program: Gaussian 09
title: 000074424
version: EM64L-G09RevD.01
frameworkgroup: C1[X(C12H10Cl2)]
method: RPBEPBE
basis: SDD
operation: Freq
keyword: #p
keyword: freq=noraman
keyword: PBEPBE/SDD
title: #p freq=noraman PBEPBE/SDD
converged: YES YES NO NO
title: Mulliken charges:
elementType: Cl Cl C C C C C C C C C C C C H H H H H H H H H H
charge: -0.082772 -0.082774 0.246213 0.246213 0.432977 0.432981 -0.387787 -0.387787 -0.422421 -0.422420 -0.258384 -0.258383 -0.819409 -0.819408 0.264262 0.264260 0.238864 0.238864 0.234337 0.234337 0.281152 0.272968 0.272967 0.281151
chargesum: 0.00000
title: Mulliken charges with hydrogens summed into heavy atoms:
elementType: Cl Cl C C C C C C C C C C C C
charge: -0.082772 -0.082774 0.246213 0.246213 0.432977 0.432981 -0.123525 -0.123527 -0.183557 -0.183555 -0.024047 -0.024046 -0.265289 -0.265290
polarizability: 1.98832208e+02 -1.76797256e+00 1.72240663e+02 -4.34867307e-03 9.90161051e-03 8.78391396e+01
1716.lowfreq: -10.9518 -0.0016 -0.0008 0.0020 5.2452 9.7597 43.8415 67.1867 67.2433
frequency: 43.8412 67.1700 67.2024 108.7163 147.3925 180.7412 243.2139 266.8882 286.1216 336.9164 446.0751 468.5896 469.8678 472.3726 503.6692 541.2454 549.3833 595.7392 629.9094 640.6560 709.7750 744.3504 781.8737 803.6642 835.9740 852.6646 888.9732 902.8388 924.0764 928.4515 940.6304 985.1943 988.5893 1072.4678 1080.0024 1127.4164 1129.1271 1161.7943 1191.1810 1195.4101 1245.4296 1247.1407 1252.0602 1254.5473 1277.0243 1383.3165 1401.7273 1427.2899 1429.6232 1462.0238 1468.6375 1472.5166 1521.3230 1592.2174 1596.8329 1626.8052 3067.6658 3067.8278 3128.5750 3129.0446 3145.1148 3146.3641 3148.8447 3149.5291 3169.6580 3170.1730
redmass: 13.8835 8.7072 6.1655 7.4643 6.7616 4.0755 3.4875 3.9027 4.3388 2.7717 4.7613 5.7976 3.3168 3.0767 5.7692 5.7331 6.9481 3.3374 5.5424 5.4351 4.4507 1.4489 5.3691 1.2995 3.1586 3.5852 2.4154 1.6614 1.5846 1.5027 2.0337 1.3588 1.3586 2.5225 1.6736 1.1039 1.3676 1.7064 1.2456 1.5526 1.2301 1.2709 1.5531 1.7035 1.9997 3.0303 3.1117 2.9773 3.4416 2.2019 1.1248 1.2234 4.4090 7.7145 5.1392 6.4456 1.0579 1.0579 1.0886 1.0887 1.1043 1.1089 1.0920 1.0961 1.0987 1.0983
irintensity: 0.1639 2.7403 0.3447 4.7126 0.9688 1.4413 3.7201 5.9973 1.4542 0.5528 11.2864 1.8685 2.5230 1.9845 0.3558 42.6175 84.2949 3.7053 32.1256 14.0406 15.4017 0.3684 0.4825 115.0058 1.0828 1.8106 14.8508 0.1667 3.9382 0.3699 10.6120 0.3313 1.0530 12.4492 0.0855 8.6928 0.0776 0.0929 4.0224 0.0223 37.4938 6.8942 10.4334 12.8526 35.9613 1.4146 0.0336 1.7588 0.0062 0.8060 19.6539 10.4309 18.0620 0.0523 3.1445 0.0959 20.3115 22.3160 15.0530 0.0443 0.1330 17.1663 13.4107 0.0598 34.3875 0.2540
temp: 298.150 k
press: 1.00000 atm
elementType: 17 17 6 6 6 6 6 6 6 6 6 6 6 6 1 1 1 1 1 1 1 1 1 1
symmnumber: 1
zpe: 480249.7 jmol-1
zpe.correction: 0.182917 hartree
zpe.thermalcorrener: 0.195098 hartree
zpe.thermalcorrenthalpy: 0.196042 hartree
zpe.thermalcorrgfe: 0.142969 hartree
zpe.sumelectzpe: -1382.430292 hartree
zpe.sumelectthermal: -1382.418111 hartree
zpe.sumelectthermalent: -1382.417167 hartree
zpe.sumelectthermalfe: -1382.470241 hartree
dipole: -0.0002 0.0005 -3.7710
dipole: 3.7710
quadrupole: -100.5682 -82.8444 -101.0898
quadrupole: -5.9164 -0.0008 0.0024
quadrupole: -5.7341 11.9897 -6.2557 -5.9164 -0.0008 0.0024
hfenergy: -1382.6132093 hartree
pointgroup: C01 [X(C12H10Cl2)]
dipole: -0.0001077 0.000168 -1.4836156 debye
dipolederiv: -0.481535 -0.1437694 0.1094111 -0.2882738 -0.3180325 0.1428245 0.4591599 0.2524946 -0.4644079 -0.4816148 -0.1437796 -0.1094443 -0.2881902 -0.3179432 -0.1427526 -0.4592265 -0.2524433 -0.4644251 -0.0166792 -0.0804689 -0.0065034 -0.1989759 -0.0581299 0.0087526 0.0137207 -0.0168423 0.0343634 -0.0166773 -0.080469 0.0064931 -0.1989738 -0.0581312 -0.0087475 -0.013756 0.0168319 0.0343657 -0.1348739 -0.0857639 0.0008637 -0.1240678 -0.0596015 0.0494402 -0.1180529 -0.0332435 -0.1127856 -0.1348611 -0.0857614 -0.0008819 -0.1241043 -0.0595995 -0.0494123 0.1180323 0.0332685 -0.1128038 0.006318 0.0507076 -0.0199495 0.0213136 0.0257444 -0.0201528 -0.056904 -0.012 -0.1386797 0.0063295 0.0507062 0.0199412 0.0213058 0.0257379 0.0201848 0.0568826 0.0120241 -0.1386821 0.1158832 -0.0686695 0.0196542 0.0639237 -0.0641972 -0.0092277 0.0257169 0.0287272 -0.1462851 0.1158801 -0.0686682 -0.019702 0.0639323 -0.0641927 0.0092379 -0.0257364 -0.0286966 -0.1462819 -0.1661054 0.0589901 -0.0121586 0.0757892 0.1601396 -0.0021076 0.0233174 -0.0161538 -0.1333913 -0.166105 0.0589896 0.0121757 0.0757939 0.1601344 0.0021608 -0.0232948 0.0162066 -0.1333859 0.6483573 0.2396062 -0.1829361 0.4168461 0.3577023 -0.2348696 -0.4141378 -0.274863 0.5736257 0.6484418 0.2396037 0.1829843 0.4167865 0.3575873 0.2347654 0.4142232 0.2747807 0.5736638 -0.0119076 -0.0924104 -0.0076257 -0.0525926 0.0523696 0.0058841 0.0096251 0.0120364 0.1390233 -0.0119109 -0.0924144 0.0076251 -0.0525929 0.0523724 -0.0058961 -0.009615 -0.0120389 0.1390188 -0.0888427 0.092796 -0.0075309 0.0671835 0.0613343 -0.0075312 0.0019564 0.0001931 0.1413294 -0.0888415 0.0927943 0.0075809 0.0671853 0.0613325 0.0075055 -0.0019107 -0.0002231 0.1413295 0.0779407 0.0070439 0.0006909 0.0057471 -0.1186327 -0.0006799 0.0027541 0.0091645 0.1579217 0.0779404 0.007042 -0.0006792 0.0057478 -0.1186308 0.0006202 -0.0027431 -0.009224 0.1579201 -0.0246895 0.0191337 -0.0011521 0.117198 0.0039011 0.0882973 0.0219025 0.0641591 0.0098002 0.0761313 0.0028102 0.0606456 -0.1040977 -0.0425927 -0.0503123 0.0698229 -0.0152683 -0.0605166 0.0761146 0.0028263 -0.0606632 -0.1040741 -0.0426075 0.0503305 -0.069864 0.0152728 -0.0604841 -0.0246932 0.0191246 0.0011611 0.1171901 0.0039355 -0.0883142 -0.0218729 -0.0641629 0.0097675 unknown
polarizability: 198.3850034|3.849363|172.6878675|-0.0063316|0.0087672|87.8391396 unknown
InChI: InChI=1S/C12H10Cl2/c13-7-9-3-1-5-11-10(8-14)4-2-6-12(9)11/h1-6H,7-8H2
charge 0 multiplicity 1
24 atoms
Cl -3.677849 -1.228584 1.357352
Cl 3.677902 1.228248 1.357157
C  -0.61473 -0.384567 -0.233155
C  0.614565 0.384606 -0.233149
C  -1.884207 0.310468 -0.250152
C  1.884039 -0.310428 -0.250457
C  -0.539115 -1.816499 -0.204704
C  0.538953 1.81653 -0.204377
C  -1.904763 1.71236 -0.226781
C  1.904598 -1.712323 -0.22739
C  0.695678 -2.466953 -0.199029
C  -0.69584 2.466983 -0.198412
C  -3.184962 -0.42838 -0.327102
C  3.184784 0.428434 -0.327417
H  -1.459607 -2.405505 -0.157173
H  1.45945 2.405529 -0.156845
H  -2.867198 2.237269 -0.227691
H  2.867033 -2.237233 -0.228539
H  0.742106 -3.560408 -0.167684
H  -0.742262 3.560431 -0.16683
H  -4.027843 0.238793 -0.551747
H  -3.176205 -1.282525 -1.018914
H  3.175938 1.28274 -1.01903
H  4.027635 -0.238688 -0.552331
