program: Orca
programVersion: 5.0.2
elementType: Cl Cl O O O N C C C C C C C C C C C C C C C C C C C C C C H H H H H H H H H H H H H H H H H H H
charge: 0
multiplicity: 1
keywords: wb97x-d3
keywords: def2-TZVPP
keywords: def2/J RIJCOSX
keywords: DEFGRID2
keywords: scfconv7
keywords: smallprint printgap noloewdin
keywords: NOSOSCF
formula: C22H19Cl2NO3
InChI: InChI=1/C22H19Cl2NO3/c1-22(2)17(12-19(23)24)20(22)21(26)28-18(13-25)14-7-6-10-16(11-14)27-15-8-4-3-5-9-15/h3-12,17-18,20H,1-2H3
47 atoms
Cl -1.246929 -0.46565 -2.46554
Cl -2.998226 -2.035854 -4.14784
O  1.442741 -2.011737 0.303243
O  -0.066212 -0.872241 1.497742
O  1.541517 3.806254 0.561459
N  4.724204 -2.026666 -0.091338
C  -1.987548 -3.277827 0.871282
C  -2.145617 -2.237167 -0.176144
C  -0.749555 -2.745553 0.165134
C  -2.281479 -2.910968 2.304143
C  -2.34005 -4.706839 0.537999
C  -2.687927 -2.510799 -1.522676
C  0.192128 -1.782349 0.749449
C  -2.36691 -1.767996 -2.572796
C  2.418723 -1.023753 0.617903
C  2.163357 0.264349 -0.129534
C  3.699835 -1.607505 0.221355
C  2.013288 1.440198 0.58827
C  2.025452 0.25172 -1.512603
C  1.689036 2.609799 -0.085561
C  1.721691 1.432154 -2.172695
C  1.53892 2.61092 -1.464724
C  0.93891 3.857184 1.795061
C  -0.144232 3.054317 2.132381
C  1.426897 4.800986 2.687763
C  -0.727043 3.197805 3.383587
C  0.82478 4.94139 3.929798
C  -0.248722 4.137066 4.287209
H  -2.346483 -1.23596 0.195671
H  -0.308287 -3.424547 -0.554703
H  -1.631138 -3.457975 2.988188
H  -3.310962 -3.183919 2.540962
H  -2.173035 -1.848596 2.506345
H  -1.842156 -5.391188 1.226176
H  -2.050715 -4.989199 -0.474312
H  -3.415771 -4.863611 0.635693
H  -3.380472 -3.331943 -1.663927
H  2.46475 -0.838717 1.695664
H  2.13356 1.431677 1.664487
H  2.14683 -0.666421 -2.073607
H  1.609714 1.43513 -3.248507
H  1.282876 3.528248 -1.979174
H  -0.535416 2.321537 1.437866
H  2.267735 5.423578 2.409397
H  -1.567015 2.569086 3.647966
H  1.206134 5.680302 4.622254
H  -0.710912 4.242476 5.259462
elementType: Cl O N C H
totalener: -2050.66995129 hartree
nucrepener: 2858.33743451 hartree
electener: -4909.00738580 hartree
oneelecener: -8492.48276119 hartree
twoeener: 3583.47537539 hartree
cpcmener: -0.03509964 hartree
kineticenergy: 2044.46592051 hartree
xcener: -151.864127308394 hartree
chargesum: -0.0000000
charge: -0.052909 -0.055795 -0.278695 -0.468766 -0.338986 -0.101467 0.148084 -0.067793 -0.082396 -0.272769 -0.284115 -0.194106 0.379965 0.066885 0.426116 0.060390 -0.220804 -0.214662 -0.283597 0.293926 -0.135949 -0.215268 0.303845 -0.197358 -0.260169 -0.145744 -0.120684 -0.192976 0.121184 0.105426 0.102853 0.096601 0.093443 0.099908 0.093304 0.104068 0.142952 0.139446 0.150350 0.152473 0.166873 0.151781 0.152011 0.148090 0.162789 0.160990 0.161257
qa: -0.0529 -0.0558 -0.2787 -0.4688 -0.3390 -0.1015 0.1481 -0.0678 -0.0824 -0.2728 -0.2841 -0.1941 0.3800 0.0669 0.4261 0.0604 -0.2208 -0.2147 -0.2836 0.2939 -0.1359 -0.2153 0.3038 -0.1974 -0.2602 -0.1457 -0.1207 -0.1930 0.1212 0.1054 0.1029 0.0966 0.0934 0.0999 0.0933 0.1041 0.1430 0.1394 0.1503 0.1525 0.1669 0.1518 0.1520 0.1481 0.1628 0.1610 0.1613
va: 1.2926 1.2519 2.1282 2.0303 2.0725 3.1096 3.7331 3.9080 3.8262 3.8822 3.9152 3.8841 4.1502 4.1936 3.7163 3.5121 4.0801 3.9492 3.9358 3.7074 3.8330 4.0073 3.6692 3.8958 4.0083 3.8857 3.8762 3.9045 1.0181 1.0278 0.9989 1.0010 1.0180 1.0024 0.9996 0.9984 1.0073 1.0172 1.0043 1.0145 0.9884 1.0026 1.0071 1.0077 0.9894 0.9879 0.9893
dispcorr: -0.026565444 hartree
energy: -2050.696516729544
dipole: -4.19809 2.03625 -2.16184 -2.37379 1.60003 -0.77376 28.50133 -27.67527 0.82607
magnitude: 2.44022 au
magnitude: 6.20254 debye
