program: Gaussian 09
title: 000074422
version: EM64L-G09RevD.01
frameworkgroup: C1[X(C9H14O6)]
method: RPBEPBE
basis: SDD
operation: Freq
keyword: #pfreq=noraman
keyword: PBEPBE/SDD
title: #p freq=noraman PBEPBE/SDD
converged: YES YES NO NO
title: Mulliken charges:
elementType: O O O O O O C C C C C C C C C H H H H H H H H H H H H H H
charge: -0.260933 -0.263476 -0.263059 -0.236045 -0.226054 -0.248281 -0.403568 -0.299871 -0.535999 0.249313 0.238505 0.241842 -0.502903 -0.504635 -0.505078 0.242941 0.248499 0.288576 0.284700 0.287008 0.246138 0.243626 0.237040 0.242840 0.247788 0.237452 0.240731 0.239491 0.233413
chargesum: 0.00000
title: Mulliken charges with hydrogens summed into heavy atoms:
elementType: O O O O O O C C C C C C C C C
charge: -0.260933 -0.263476 -0.263059 -0.236045 -0.226054 -0.248281 0.087872 -0.011295 0.035709 0.249313 0.238505 0.241842 0.223900 0.223445 0.208557
polarizability: 1.37536721e+02 -5.55610347e+00 1.15279600e+02 -1.86934139e-02 5.70957102e+00 9.58399647e+01
1716.lowfreq: -6.8985 -3.2695 0.0006 0.0008 0.0009 7.6920 15.6702 20.0063 33.4502
frequency: 15.2371 19.9361 33.3776 42.3660 80.7187 86.4701 96.3770 99.4402 105.0613 116.3115 145.0598 169.5286 174.3386 197.4138 216.0549 253.4457 276.0232 285.4865 318.2331 370.2667 417.9610 486.7744 548.7942 562.7252 648.0873 661.3722 729.0981 737.4593 774.7189 828.1065 849.2609 854.9605 919.7049 954.4038 964.2311 1011.6715 1052.5066 1101.8943 1112.8891 1113.1909 1114.8134 1122.8956 1140.7403 1148.3030 1149.4498 1151.2178 1163.5463 1185.8392 1241.3682 1278.0167 1311.7079 1329.1972 1377.2475 1420.8519 1422.1888 1423.3705 1452.0995 1453.3321 1453.6257 1454.5884 1462.6798 1462.8998 1463.8813 1465.5653 1637.5651 1641.2044 1648.1393 3001.9244 3003.8531 3007.3500 3007.9015 3014.6435 3027.3007 3064.7439 3086.0771 3104.4225 3110.7479 3111.7215 3148.2208 3153.6803 3154.7791
redmass: 5.4608 6.5029 4.4210 4.8618 2.6725 2.1310 1.3993 1.2937 1.1052 2.9827 4.0865 3.3295 2.9531 4.5756 5.2412 3.2040 4.5780 4.1810 5.3133 7.1588 4.4388 5.2378 4.9349 3.4155 5.1337 3.6753 6.5935 5.1980 1.9387 4.7976 5.0044 3.8321 7.2476 4.6598 4.7457 3.2760 2.2751 3.9139 1.2949 1.2700 1.2751 2.9653 2.8665 1.4405 1.4625 1.4763 2.5184 1.3464 1.8634 1.2661 1.4845 1.5288 1.5589 1.1915 1.1973 1.1788 1.0512 1.0564 1.0695 1.0508 1.0505 1.0510 1.0597 1.0788 8.6772 8.6270 9.9996 1.0558 1.0382 1.0294 1.0296 1.0645 1.0776 1.0974 1.0999 1.1045 1.1047 1.1049 1.1047 1.1050 1.1049
irintensity: 1.8424 1.1472 1.5098 1.6719 1.3390 1.0055 0.7594 0.2572 0.3060 0.7627 1.1775 3.4540 12.7590 2.0217 6.6535 3.9011 16.0531 30.6559 12.9858 8.0609 1.5514 15.2918 4.2418 7.0523 3.8700 2.1300 8.0842 6.7350 28.3636 6.9128 3.4939 10.4074 8.8214 13.5117 34.0548 23.7160 39.4465 132.1978 5.2497 1.6900 2.1047 187.5034 253.1615 4.5532 14.1528 24.2736 175.4476 113.9182 26.0150 40.2414 96.1528 76.4921 16.2445 22.9203 26.9671 14.0891 17.6169 15.4552 9.9257 12.6858 14.5839 9.6059 14.1578 38.5899 85.3915 157.0847 260.7704 40.2472 11.4845 32.7680 25.6277 8.0909 8.2500 3.8225 6.5059 28.4652 23.2173 22.5469 16.8866 14.7722 13.7141
temp: 298.150 k
press: 1.00000 atm
elementType: 8 8 8 8 8 8 6 6 6 6 6 6 6 6 6 1 1 1 1 1 1 1 1 1 1 1 1 1 1
symmnumber: 1
zpe: 592179.4 jmol-1
zpe.correction: 0.225549 hartree
zpe.thermalcorrener: 0.243644 hartree
zpe.thermalcorrenthalpy: 0.244588 hartree
zpe.thermalcorrgfe: 0.175366 hartree
zpe.sumelectzpe: -801.515902 hartree
zpe.sumelectthermal: -801.497807 hartree
zpe.sumelectthermalent: -801.496863 hartree
zpe.sumelectthermalfe: -801.566085 hartree
dipole: -2.3509 0.5572 -0.5219
dipole: 2.4718
quadrupole: -68.7108 -80.8462 -92.5579
quadrupole: -0.7996 -4.2179 -0.8759
quadrupole: 11.9941 -0.1412 -11.8529 -0.7996 -4.2179 -0.8759
hfenergy: -801.7414513 hartree
pointgroup: C01 [X(C9H14O6)]
dipole: 0.9456225 -0.2168586 -0.0670218 debye
polarizability: 137.0307782|-3.9391112|113.4881574|5.612016|-8.2466999|98.1373501 unknown
InChI: InChI=1S/C9H14O6/c1-13-7(10)5-4-6(8(11)14-2)9(12)15-3/h6H,4-5H2,1-3H3
charge 0 multiplicity 1
29 atoms
O  1.877425 -1.935774 1.058763
O  2.591406 1.398126 0.181103
O  -3.762324 0.351079 -1.24466
O  1.121747 -1.222636 -1.025141
O  0.556613 2.524722 0.253598
O  -3.609858 -0.65181 0.850321
C  -0.846248 0.128966 1.095127
C  0.704668 0.157337 0.999068
C  -1.581595 0.254336 -0.254757
C  1.248147 -1.031819 0.205596
C  1.225275 1.484159 0.431635
C  -3.056792 -0.071498 -0.11367
C  2.416922 -3.158885 0.412045
C  3.230688 2.622679 -0.362767
C  -5.213973 0.048151 -1.245215
H  -1.155769 0.959466 1.754914
H  -1.153401 -0.80657 1.596412
H  1.116535 0.070223 2.022278
H  -1.150996 -0.435373 -1.006728
H  -1.477177 1.269262 -0.674457
H  3.16707 -2.88375 -0.347748
H  1.602424 -3.725756 -0.069027
H  2.870656 -3.731612 1.23233
H  3.129873 3.454246 0.35457
H  2.756579 2.90343 -1.317694
H  4.284011 2.346645 -0.507358
H  -5.708686 0.544547 -0.393407
H  -5.378475 -1.040273 -1.173051
H  -5.581645 0.44278 -2.20268
