program: Orca
programVersion: 5.0.2
elementType: Cl Cl O O O N C C C C C C C C C C C C C C C C C C C C C C H H H H H H H H H H H H H H H H H H H
charge: 0
multiplicity: 1
keywords: wb97x-d3
keywords: def2-TZVPP
keywords: def2/J RIJCOSX
keywords: DEFGRID2
keywords: scfconv7
keywords: smallprint printgap noloewdin
keywords: NOSOSCF
formula: C22H19Cl2NO3
InChI: InChI=1/C22H19Cl2NO3/c1-22(2)17(12-19(23)24)20(22)21(26)28-18(13-25)14-7-6-10-16(11-14)27-15-8-4-3-5-9-15/h3-12,17-18,20H,1-2H3
47 atoms
Cl -3.258778 -0.338029 2.133547
Cl -4.855524 0.430707 -0.143735
O  1.428918 -1.696179 0.404161
O  1.835518 -1.909544 -1.774399
O  1.544685 3.263636 -0.613116
N  4.424986 -3.233308 -0.119772
C  -1.198847 -3.203915 -0.342983
C  -1.424453 -1.764893 0.028257
C  -0.402866 -2.112537 -1.033496
C  -0.553006 -4.10671 0.678753
C  -2.212234 -3.917301 -1.203787
C  -2.633757 -1.040557 -0.390764
C  1.043893 -1.906051 -0.864093
C  -3.461854 -0.404419 0.427029
C  2.780718 -1.338326 0.621778
C  3.135238 0.020688 0.045543
C  3.686114 -2.399047 0.164278
C  2.142644 0.994664 -0.015308
C  4.432431 0.313766 -0.344952
C  2.459743 2.260394 -0.488198
C  4.733043 1.588628 -0.807979
C  3.757472 2.564387 -0.88633
C  0.283309 3.105212 -0.078314
C  0.093715 3.172144 1.294656
C  -0.784929 2.928585 -0.942144
C  -1.191797 3.059344 1.80393
C  -2.068226 2.826673 -0.420391
C  -2.274709 2.888293 0.950439
H  -1.024296 -1.482394 0.994998
H  -0.703861 -1.929717 -2.059144
H  -1.32901 -4.626484 1.242807
H  0.067509 -3.575799 1.397226
H  0.06206 -4.864887 0.191029
H  -3.04254 -4.274658 -0.592318
H  -1.755238 -4.784829 -1.682176
H  -2.622418 -3.2865 -1.991138
H  -2.874268 -1.021907 -1.447178
H  2.879879 -1.301253 1.710168
H  1.131762 0.768966 0.298527
H  5.215313 -0.431794 -0.296347
H  5.74374 1.8207 -1.11558
H  3.993075 3.554623 -1.254407
H  0.938873 3.311097 1.957431
H  -0.617027 2.878716 -2.010439
H  -1.34631 3.109595 2.873691
H  -2.90602 2.693279 -1.091785
H  -3.274838 2.80593 1.353685
elementType: Cl O N C H
totalener: -2050.66969615 hartree
nucrepener: 2930.98273211 hartree
electener: -4981.65242826 hartree
oneelecener: -8637.14227631 hartree
twoeener: 3655.48984805 hartree
cpcmener: -0.04047524 hartree
kineticenergy: 2044.45713389 hartree
xcener: -151.868879660289 hartree
chargesum: -0.0000000
charge: -0.058333 -0.061145 -0.284801 -0.451379 -0.335812 -0.094159 0.101390 0.054290 -0.100360 -0.269446 -0.264770 -0.229315 0.414170 0.048406 0.454066 -0.037051 -0.229882 -0.234988 -0.237929 0.325162 -0.093612 -0.260495 0.248755 -0.173053 -0.198066 -0.154686 -0.155253 -0.149232 0.092919 0.101523 0.097831 0.095699 0.104351 0.101112 0.100380 0.091937 0.139737 0.147686 0.136226 0.135507 0.161408 0.147542 0.155840 0.150282 0.161002 0.153056 0.153490
qa: -0.0583 -0.0611 -0.2848 -0.4514 -0.3358 -0.0942 0.1014 0.0543 -0.1004 -0.2694 -0.2648 -0.2293 0.4142 0.0484 0.4541 -0.0371 -0.2299 -0.2350 -0.2379 0.3252 -0.0936 -0.2605 0.2488 -0.1731 -0.1981 -0.1547 -0.1553 -0.1492 0.0929 0.1015 0.0978 0.0957 0.1044 0.1011 0.1004 0.0919 0.1397 0.1477 0.1362 0.1355 0.1614 0.1475 0.1558 0.1503 0.1610 0.1531 0.1535
va: 1.2648 1.2447 2.1287 2.0487 2.0780 3.0993 3.7493 3.7971 3.9309 3.9046 3.9125 3.8541 4.1076 4.1967 3.8183 3.8193 4.0988 3.9415 3.9756 3.7048 3.9064 4.0171 3.6962 3.9392 4.0047 3.9094 3.8187 3.7932 1.0371 1.0308 1.0007 1.0131 0.9994 1.0009 1.0013 1.0045 1.0128 0.9890 1.0220 1.0156 0.9882 1.0078 0.9972 1.0030 0.9908 1.0004 1.0073
dispcorr: -0.029032923 hartree
energy: -2050.698729069420
dipole: 10.56276 -12.26376 -1.70100 -9.54998 9.98736 0.43739 -4.63608 5.82790 1.19182
magnitude: 2.12253 au
magnitude: 5.39503 debye
