program: Gaussian 09
title: 000074418
version: EM64L-G09RevD.01
frameworkgroup: C1[X(C18H13NO)]
method: RPBEPBE
basis: SDD
operation: Freq
keyword: #p
keyword: freq=noraman
keyword: PBEPBE/SDD
title: #p freq=noraman PBEPBE/SDD
converged: NO YES NO NO
title: Mulliken charges:
elementType: O N C C C C C C C C C C C C C C C C C C H H H H H H H H H H H H H
charge: -0.256192 -0.457877 -0.037913 0.024509 0.539620 0.543349 0.472284 0.473110 -0.494906 -0.496936 -0.636693 -0.764331 -0.484354 -0.482986 0.549515 -0.464338 -0.463466 -0.243667 0.211609 -0.801255 0.320834 0.230013 0.246855 0.236083 0.236143 0.236887 0.240622 0.241545 0.226216 0.312375 0.235519 0.269595 0.238232
chargesum: 0.00000
title: Mulliken charges with hydrogens summed into heavy atoms:
elementType: O N C C C C C C C C C C C C C C C C C C
charge: -0.256192 -0.145502 -0.037913 0.024509 0.539620 0.543349 0.472284 0.473110 -0.248052 -0.260852 -0.315858 -0.534318 -0.248211 -0.246098 0.549515 -0.223717 -0.221921 -0.017451 0.211609 -0.057910
polarizability: 3.87785420e+02 -6.28246956e+00 2.25634839e+02 -1.85627364e-02 1.60136618e-02 8.23774376e+01
1716.lowfreq: -78.2146 -8.4205 -0.0006 0.0004 0.0005 4.8741 8.1680 42.6128 59.2784
frequency: -78.2128 42.6027 59.2757 107.8610 111.4528 156.9220 204.1837 222.5301 243.9684 248.8057 271.5344 356.7029 392.7390 398.4735 430.0572 462.5275 494.2390 497.6266 503.7729 538.0612 539.4645 539.9456 558.0742 577.6764 589.7486 630.1171 656.5071 689.3430 696.6230 736.1807 751.0195 770.4312 774.3258 809.8258 818.9269 839.7094 866.7678 895.0967 912.0747 917.2983 945.4122 955.3765 976.5254 984.2830 986.0361 988.1031 993.4732 1018.2117 1030.3820 1080.9627 1120.3048 1144.3547 1173.2565 1180.5822 1191.2573 1219.2087 1237.4448 1244.9341 1255.3896 1309.4781 1338.9267 1369.8259 1374.7006 1389.7706 1408.7307 1434.8845 1436.8492 1446.5316 1451.6324 1463.2367 1468.1384 1472.3925 1496.1201 1529.4683 1567.8449 1597.1998 1609.0252 1615.1817 1635.4416 1641.3919 2986.8030 3072.2589 3103.1671 3117.4938 3121.8599 3122.7809 3131.2227 3135.7624 3142.8679 3147.9076 3156.3941 3184.3816 3522.6452
redmass: 1.0527 5.5535 4.9257 4.2554 5.0407 4.2198 4.3014 4.3817 8.4074 3.4986 4.0161 4.6675 4.8638 3.4734 5.4642 7.3657 5.0224 4.4645 3.6606 3.3204 5.1922 3.1670 6.3174 3.1277 5.7867 1.7197 1.6748 6.0645 3.4705 2.3276 5.7025 1.2618 5.4088 4.9192 1.4557 1.8821 2.6711 1.6767 4.8119 1.5464 1.5798 2.5861 1.3842 5.0485 1.3951 6.1763 1.4308 2.3124 1.6614 1.9163 2.4826 1.5037 1.2574 1.4154 1.2560 1.7003 2.2526 1.5342 1.8621 2.6003 2.9078 2.3714 1.2556 4.8342 2.2765 3.8181 5.6159 1.4477 2.3599 3.8639 1.0472 3.2239 4.6539 2.3774 4.5860 8.0619 6.2044 6.0694 5.0030 7.6304 1.0383 1.0984 1.0913 1.0859 1.0861 1.0862 1.0918 1.0979 1.0980 1.0980 1.0989 1.0929 1.0764
irintensity: 0.0160 0.1840 12.0423 0.0139 5.8038 0.0309 6.4362 6.0178 3.2816 0.0204 2.0250 0.5783 1.1738 0.0056 8.7480 0.2367 4.7653 0.2145 0.1212 0.6418 6.6895 0.3037 5.1868 2.1965 1.4385 31.4459 36.1620 0.0504 4.3714 60.9103 0.6276 6.5350 0.2656 4.8937 0.0156 0.8980 50.3362 39.8527 1.3671 13.9810 67.2092 21.1739 9.2696 2.6086 2.3278 9.9393 1.0409 9.6361 8.1476 8.4118 0.4976 0.2309 5.0516 0.0945 16.5009 7.8355 135.0870 9.3115 9.4198 12.0943 0.0773 158.2316 77.0834 7.7438 101.0738 3.4137 16.1208 20.2831 93.2655 3.3336 19.9800 148.4677 6.5357 281.7350 37.7058 11.4667 13.4956 102.9820 133.8180 20.3661 9.7889 15.4983 18.3958 2.6165 0.4674 1.4835 14.8277 7.6887 39.1022 23.2110 45.7898 11.7859 11.3540
temp: 298.150 k
press: 1.00000 atm
elementType: 8 7 6 6 6 6 6 6 6 6 6 6 6 6 6 6 6 6 6 6 1 1 1 1 1 1 1 1 1 1 1 1 1
symmnumber: 1
zpe: 676131.2 jmol-1
zpe.correction: 0.257525 hartree
zpe.thermalcorrener: 0.271875 hartree
zpe.thermalcorrenthalpy: 0.272819 hartree
zpe.thermalcorrgfe: 0.216182 hartree
zpe.sumelectzpe: -822.415608 hartree
zpe.sumelectthermal: -822.401258 hartree
zpe.sumelectthermalent: -822.400313 hartree
zpe.sumelectthermalfe: -822.456950 hartree
dipole: -0.4384 3.6475 0.0100
dipole: 3.6738
quadrupole: -94.5184 -103.4065 -122.4951
quadrupole: -17.7916 -0.0491 -0.0042
quadrupole: 12.2882 3.4002 -15.6884 -17.7916 -0.0491 -0.0042
hfenergy: -822.6731326 hartree
pointgroup: C01 [X(C18H13N1O1)]
dipole: -0.1575483 1.4367558 0.0037383 debye
polarizability: 387.6372514|-7.9668845|225.7829977|0.0609789|-0.0020744|82.3774469 unknown
InChI: InChI=1S/C18H13NO/c1-11(20)19-16-9-14-7-5-12-3-2-4-13-6-8-15(10-16)18(14)17(12)13/h2-10,19H,1H3
charge 0 multiplicity 1
33 atoms
O  -4.630205 -1.48184 -0.003277
N  -3.73111 0.689751 -0.003264
C  0.506213 0.109893 -0.000861
C  1.930627 -0.061648 -0.00002
C  -0.368116 -1.03656 -0.001123
C  -0.066717 1.433893 -0.001482
C  2.798696 1.091219 0.000288
C  2.4982 -1.388527 0.000534
C  0.227643 -2.357715 -0.000597
C  0.825819 2.575584 -0.001165
C  -1.775835 -0.862486 -0.001922
C  -1.474526 1.577323 -0.002324
C  2.198936 2.409771 -0.000311
C  1.600768 -2.525297 0.000201
C  -2.327241 0.442969 -0.002494
C  4.206346 0.898021 0.001155
C  3.911695 -1.536072 0.001384
C  4.753977 -0.403302 0.001696
C  -4.788054 -0.226801 -0.002456
C  -6.168729 0.433409 0.001878
H  -2.445189 -1.724958 -0.002275
H  -1.905868 2.587598 -0.002763
H  -0.439441 -3.227343 -0.000848
H  0.3892 3.58152 -0.001611
H  2.862393 3.282911 -0.000073
H  2.035669 -3.531852 0.000586
H  4.867177 1.772953 0.001398
H  4.344222 -2.543504 0.001795
H  5.841501 -0.534986 0.002356
H  -3.998103 1.677271 -0.003674
H  -6.303363 1.094006 -0.874732
H  -6.933389 -0.355729 -0.029274
H  -6.320393 1.037628 0.915676
