program: Gaussian 09
title: 000074414
version: EM64L-G09RevD.01
frameworkgroup: C1[X(C11H14O)]
method: RPBEPBE
basis: SDD
operation: Freq
keyword: #pfreq=noraman
keyword: PBEPBE/SDD
title: #p freq=noraman PBEPBE/SDD
converged: YES YES NO NO
title: Mulliken charges:
elementType: O C C C C C C C C C C C H H H H H H H H H H H H H H
charge: -0.270853 -0.411542 -0.410641 -0.531727 -0.535500 0.304134 0.290217 -0.532450 -0.393171 0.324575 -0.385038 -0.536676 0.206304 0.203459 0.205248 0.203661 0.217737 0.222795 0.214403 0.218689 0.253478 0.226468 0.238223 0.218195 0.218110 0.241902
chargesum: 0.00000
title: Mulliken charges with hydrogens summed into heavy atoms:
elementType: O C C C C C C C C C C C
charge: -0.270853 -0.001779 -0.001732 -0.091195 -0.102407 0.304134 0.290217 -0.278972 -0.166702 0.324575 -0.146815 0.141531
polarizability: 1.66989541e+02 9.69738940e-02 1.19273396e+02 -1.36672688e-01 -1.19059263e+00 7.12799961e+01
1716.lowfreq: -12.2825 -0.0007 -0.0004 -0.0002 7.7704 12.6131 67.7491 106.0518 121.7166
frequency: 67.6236 106.0196 121.7075 192.5093 209.1617 233.4627 293.2265 320.1061 340.2825 379.3287 431.9778 444.7446 476.5091 540.7034 570.6369 607.9713 688.7400 704.0307 723.9640 798.9044 827.1912 857.9594 875.2990 885.7388 910.6442 938.2382 941.2754 994.6975 1007.9483 1083.1617 1092.3340 1113.0450 1123.6543 1132.7782 1142.7232 1161.8744 1175.3511 1204.3405 1231.9691 1246.6929 1254.8052 1279.1748 1326.6656 1333.0946 1344.4343 1352.0270 1382.9069 1424.0019 1437.6114 1453.0998 1459.3539 1464.5050 1469.4433 1474.7649 1475.1823 1497.6686 1582.1432 1625.2689 2952.3794 2953.1837 2958.4771 2977.1090 2977.9299 3015.2720 3021.2391 3037.3975 3038.4601 3046.9313 3110.9214 3121.3837 3138.3864 3161.0207
redmass: 2.9922 2.7541 2.6402 3.4936 2.2437 1.3034 2.1505 2.9120 2.8385 4.0600 2.6746 3.3507 3.2340 4.1484 2.9575 3.0147 3.4532 3.0018 4.5265 1.4075 1.5379 3.0016 1.7691 2.2153 1.4555 2.4995 1.4074 2.4944 4.1264 1.8522 1.6769 1.2600 1.8061 1.1687 1.5145 1.4082 1.5071 2.1828 1.6076 1.4477 2.1572 1.2082 1.4783 1.5471 1.4027 1.6751 5.2810 3.1270 1.2546 1.1407 1.0891 1.0503 1.0865 1.1014 1.0714 2.4647 6.8883 6.9553 1.0565 1.0411 1.0644 1.0637 1.0621 1.0940 1.0949 1.1036 1.0987 1.1043 1.0890 1.0988 1.0914 1.0936
irintensity: 3.7403 3.9688 0.7689 3.1970 0.1337 0.2680 0.9614 1.3052 6.0895 1.3434 4.1284 3.1832 1.6460 5.5360 3.8520 2.0612 9.9847 2.6081 0.2554 32.7384 15.0050 4.3201 5.5797 6.8962 14.3957 2.0222 5.2040 11.6581 50.0926 1.1725 0.0786 0.2477 30.3973 2.8610 14.6816 1.5356 36.6831 15.7299 13.2056 48.8297 60.3791 10.4364 1.3134 1.6883 1.2891 1.4277 11.3475 21.0545 2.0753 2.5640 15.4528 12.5773 12.0982 26.5563 28.1784 95.9865 18.2465 65.8989 45.1922 66.6603 24.7501 35.1792 32.8723 51.7610 21.7022 53.4950 74.3509 73.5967 23.0692 24.4363 6.3512 16.4757
temp: 298.150 k
press: 1.00000 atm
elementType: 8 6 6 6 6 6 6 6 6 6 6 6 1 1 1 1 1 1 1 1 1 1 1 1 1 1
symmnumber: 1
zpe: 582251.0 jmol-1
zpe.correction: 0.221768 hartree
zpe.thermalcorrener: 0.232524 hartree
zpe.thermalcorrenthalpy: 0.233468 hartree
zpe.thermalcorrgfe: 0.185611 hartree
zpe.sumelectzpe: -501.891094 hartree
zpe.sumelectthermal: -501.880338 hartree
zpe.sumelectthermalent: -501.879394 hartree
zpe.sumelectthermalfe: -501.927251 hartree
dipole: -0.1766 1.1841 -0.0238
dipole: 1.1974
quadrupole: -59.4968 -69.1811 -74.7749
quadrupole: -5.0115 0.1003 -0.3046
quadrupole: 8.3208 -1.3635 -6.9573 -5.0115 0.1003 -0.3046
hfenergy: -502.1128618 hartree
pointgroup: C01 [X(C11H14O1)]
dipole: 0.068022 -0.4660473 -0.0108344 debye
dipolederiv: -1.7556422 -0.1234993 -0.008093 -0.3230536 -0.357381 -0.0027526 -0.0102391 -0.0013981 -0.3008116 0.1047666 -0.0331425 -0.0182961 -0.0005648 0.0233938 0.0295795 0.0313288 0.0219858 0.1376628 0.1071882 0.0058802 0.0264271 -0.0288106 0.0189688 0.0213613 -0.0250532 0.0290693 0.1371371 0.029245 0.011441 -0.0078662 0.050964 0.0423453 -0.0124482 0.0555881 -0.0435002 0.1568889 0.0582783 0.0148652 0.0137697 -0.0159651 0.0723959 -0.0129443 -0.0508661 -0.0304953 0.1708905 0.1949383 -0.0616449 -0.0277184 -0.2234469 0.2168857 0.0110127 -0.1188308 0.038112 -0.0547791 0.0488434 0.1760477 0.0286807 0.2531182 -0.2078401 -0.0113206 0.1348718 0.0027717 -0.0770331 -0.4753297 -0.0439026 0.000613 0.1551686 0.0381319 0.0183573 0.0121559 0.0114257 -0.1878099 0.0928891 -0.1247286 -0.0025959 0.0252929 0.1509178 0.0203626 -0.0061235 0.0178895 -0.1465132 1.3831903 0.2805843 0.0069674 0.6348724 0.187843 0.0024211 0.0232485 -0.0015945 0.0909192 -0.286566 0.0222577 0.0060566 -0.3562533 -0.1275709 -0.003179 -0.0154713 -0.002242 -0.2209712 0.7987483 -0.0593743 -0.0006282 -0.3910565 0.2599726 -0.0031842 -0.0121599 -0.0019399 0.331894 -0.1430931 0.138751 0.0179439 0.1527905 -0.0684011 -0.0161954 0.0514906 -0.0348585 0.0717936 0.066774 -0.0249871 0.0134473 -0.0580794 0.0480592 -0.0509242 -0.0440903 -0.0031742 -0.1842833 -0.2256915 -0.094266 -0.0177945 -0.1042005 0.0089908 -0.007943 -0.0564952 -0.0163705 0.072855 0.0909458 0.0121427 -0.0331744 0.0423049 0.0274064 -0.044756 0.0357684 -0.0144657 -0.1852069 -0.0260237 0.058211 0.0148694 0.0442702 0.0308133 -0.0593284 0.0228053 -0.1122992 -0.1211606 -0.0061889 -0.0612682 0.0375166 -0.0190042 -0.1051928 0.0909876 -0.0028391 0.1292189 0.0253924 -0.0738808 -0.0457167 -0.0382696 -0.0313259 0.0555053 -0.051412 -0.0753522 -0.104447 -0.1290487 -0.0005999 0.0232029 -0.0090177 -0.0283637 -0.1295667 0.0990075 0.042849 0.1236954 0.0231156 0.0953867 -0.0122509 -0.0015641 -0.037716 -0.0744268 -0.0073786 -0.0043774 -0.0029116 0.1563736 0.0661106 -0.0567765 -0.000944 -0.0337673 -0.1282302 -0.0087799 0.0028788 -0.0042798 0.1379998 -0.0575875 0.0981972 0.0029281 0.1073056 0.0307868 -0.0030812 0.0033595 -0.0017939 0.1682556 0.0138606 -0.0071879 -0.0287892 0.1605192 -0.0092273 -0.1204531 0.0470551 -0.106021 -0.104053 0.0137466 -0.0092595 0.0284043 0.1631188 -0.0236483 0.1262086 -0.0369617 0.1110291 -0.0900743 -0.1143084 -0.0835761 -0.0028731 -0.1381176 0.0190688 -0.0032173 -0.0045403 -0.0034057 0.1205669 unknown
polarizability: 166.9897229|-0.0514016|119.2653088|0.1258108|1.3408061|71.2879013 unknown
InChI: InChI=1S/C11H14O/c1-12-11-7-6-9-4-2-3-5-10(9)8-11/h6-8H,2-5H2,1H3
charge 0 multiplicity 1
26 atoms
O  3.090436 0.842056 0.029081
C  -3.119597 0.957643 -0.341232
C  -3.323188 -0.402207 0.361834
C  -1.770969 1.58222 0.080458
C  -2.234222 -1.401844 -0.086134
C  -0.604611 0.595995 0.016147
C  -0.82545 -0.812856 -0.032133
C  0.717795 1.092123 0.03343
C  0.298463 -1.671263 -0.054747
C  1.828172 0.218207 0.008275
C  1.622883 -1.182681 -0.035602
C  4.267391 -0.025565 0.003306
H  -3.945698 1.65169 -0.095565
H  -3.137304 0.804651 -1.43918
H  -4.325436 -0.812113 0.133657
H  -3.272288 -0.255032 1.459573
H  -1.861343 1.956293 1.122088
H  -1.542982 2.467569 -0.543817
H  -2.453717 -1.721168 -1.127128
H  -2.278288 -2.320062 0.531499
H  0.90849 2.17086 0.067757
H  0.136059 -2.756535 -0.087631
H  2.462948 -1.883161 -0.053018
H  4.300222 -0.63776 -0.919898
H  4.298681 -0.6935 0.887084
H  5.129654 0.65714 0.025096
