program: Orca
programVersion: 5.0.2
elementType: Cl Cl O O O N C C C C C C C C C C C C C C C C C C C C C C H H H H H H H H H H H H H H H H H H H
charge: 0
multiplicity: 1
keywords: wb97x-d3
keywords: def2-TZVPP
keywords: def2/J RIJCOSX
keywords: DEFGRID2
keywords: scfconv7
keywords: smallprint printgap noloewdin
keywords: NOSOSCF
formula: C22H19Cl2NO3
InChI: InChI=1/C22H19Cl2NO3/c1-22(2)17(12-19(23)24)20(22)21(26)28-18(13-25)14-7-6-10-16(11-14)27-15-8-4-3-5-9-15/h3-12,17-18,20H,1-2H3
47 atoms
Cl -1.713546 0.112476 -1.139621
Cl -4.419474 0.356494 -0.202868
O  1.373779 -1.817365 -0.944488
O  1.604693 -2.451688 1.183782
O  1.302736 2.834358 1.212213
N  3.268912 -0.761866 -3.426779
C  -1.302851 -3.538841 1.006446
C  -1.429807 -2.062645 1.201784
C  -0.537958 -2.598045 0.098798
C  -0.612991 -4.370341 2.058556
C  -2.441893 -4.262361 0.327527
C  -2.68617 -1.337505 0.921876
C  0.903145 -2.318194 0.213301
C  -2.892095 -0.421497 -0.013483
C  2.721453 -1.377918 -0.94758
C  2.975182 -0.158261 -0.085017
C  3.008655 -1.043795 -2.342708
C  1.971089 0.778899 0.121989
C  4.238071 0.016896 0.459644
C  2.24353 1.897606 0.897572
C  4.496731 1.146622 1.222841
C  3.507279 2.08861 1.445366
C  0.199158 3.02812 0.411325
C  0.3295 3.300148 -0.943965
C  -1.045432 3.024574 1.021852
C  -0.808324 3.57354 -1.688752
C  -2.174362 3.309374 0.265983
C  -2.060738 3.582194 -1.089272
H  -0.896723 -1.676745 2.067748
H  -0.921894 -2.529318 -0.910864
H  -0.053453 -5.188989 1.603788
H  -1.36282 -4.814434 2.713989
H  0.067543 -3.799033 2.683853
H  -3.212318 -4.524279 1.054364
H  -2.087367 -5.187565 -0.128946
H  -2.909051 -3.664143 -0.454848
H  -3.518203 -1.561744 1.580628
H  3.401362 -2.186001 -0.657681
H  0.98583 0.63328 -0.301506
H  5.01096 -0.722764 0.293872
H  5.478377 1.292879 1.652997
H  3.705182 2.965265 2.048636
H  1.305711 3.309267 -1.413065
H  -1.128006 2.811863 2.080259
H  -0.710016 3.787538 -2.74494
H  -3.146099 3.308435 0.741515
H  -2.942771 3.798806 -1.676898
elementType: Cl O N C H
totalener: -2050.66646917 hartree
nucrepener: 2981.35620546 hartree
electener: -5032.02267463 hartree
oneelecener: -8738.77689295 hartree
twoeener: 3706.75421832 hartree
cpcmener: -0.03500140 hartree
kineticenergy: 2044.47711070 hartree
xcener: -151.870527568180 hartree
chargesum: 0.0000000
charge: -0.044637 -0.065235 -0.281744 -0.459537 -0.336113 -0.100191 0.141458 -0.003847 -0.123195 -0.281476 -0.278266 -0.238008 0.383672 0.114355 0.402921 0.001667 -0.221273 -0.179416 -0.225225 0.314305 -0.100743 -0.259188 0.302327 -0.195904 -0.246336 -0.133322 -0.136526 -0.179455 0.113809 0.114226 0.103267 0.094952 0.092758 0.102244 0.101241 0.093217 0.136452 0.149501 0.092492 0.147080 0.162273 0.149060 0.156851 0.147832 0.160695 0.154262 0.156723
qa: -0.0446 -0.0652 -0.2817 -0.4595 -0.3361 -0.1002 0.1415 -0.0038 -0.1232 -0.2815 -0.2783 -0.2380 0.3837 0.1144 0.4029 0.0017 -0.2213 -0.1794 -0.2252 0.3143 -0.1007 -0.2592 0.3023 -0.1959 -0.2463 -0.1333 -0.1365 -0.1795 0.1138 0.1142 0.1033 0.0950 0.0928 0.1022 0.1012 0.0932 0.1365 0.1495 0.0925 0.1471 0.1623 0.1491 0.1569 0.1478 0.1607 0.1543 0.1567
va: 1.3001 1.2382 2.1159 2.0435 2.0782 3.1110 3.7244 3.8472 3.8714 3.8876 3.9134 3.9492 4.1582 4.1253 3.7069 3.6617 4.0781 3.9460 3.9796 3.6791 3.8814 3.9953 3.6394 3.9161 3.9735 3.8546 3.8169 3.8658 1.0217 1.0278 0.9982 1.0010 1.0189 1.0000 1.0024 0.9985 1.0151 1.0146 1.0596 1.0013 0.9873 1.0067 0.9969 1.0065 0.9885 0.9973 0.9919
dispcorr: -0.029889109 hartree
energy: -2050.696358276049
dipole: 5.66289 -6.73927 -1.07638 -13.59623 12.50307 -1.09316 11.66886 -10.29074 1.37811
magnitude: 2.06223 au
magnitude: 5.24177 debye
