program: Gaussian 09
title: 000074410
version: EM64L-G09RevD.01
frameworkgroup: C1[X(C3H3IO)]
method: RPBEPBE
basis: SDD
operation: Freq
keyword: #pfreq=noraman
keyword: PBEPBE/SDD
title: #p freq=noraman PBEPBE/SDD
converged: NO NO NO NO
title: Mulliken charges:
elementType: I O C C C H H H
charge: 0.178459 -0.429177 -0.393225 0.321453 -0.496147 0.223748 0.248489 0.346401
chargesum: 0.00000
title: Mulliken charges with hydrogens summed into heavy atoms:
elementType: I O C C C
charge: 0.178459 -0.082776 0.079011 0.321453 -0.496147
polarizability: 1.04006986e+02 5.78393981e+00 2.90972092e+01 1.22626377e-02 1.27947287e+00 2.43474528e+01
1716.lowfreq: -5.6773 0.0002 0.0003 0.0004 5.4896 19.0334 95.6298 144.0287 252.2721
frequency: 95.6057 144.0220 252.2710 300.7275 354.7994 364.2961 557.7726 904.1570 972.3140 1021.0552 1168.6572 1292.4331 1368.9386 1454.0067 2220.9782 2962.2238 3069.8289 3554.2978
redmass: 7.5966 3.6551 5.3847 2.6065 2.2277 3.9516 7.5177 4.8716 1.6657 5.9241 1.0927 1.2017 1.1868 1.0790 11.8014 1.0681 1.0926 1.0665
irintensity: 0.5085 7.4345 18.1959 89.3902 73.9244 39.1522 10.9271 100.8159 0.8454 40.2143 23.2424 9.0723 54.0956 5.2191 35.3749 54.7288 10.7695 10.7518
temp: 298.150 k
press: 1.00000 atm
elementType: 53 8 6 6 6 1 1 1
symmnumber: 1
zpe: 131938.4 jmol-1
zpe.correction: 0.050253 hartree
zpe.thermalcorrener: 0.056444 hartree
zpe.thermalcorrenthalpy: 0.057389 hartree
zpe.thermalcorrgfe: 0.018499 hartree
zpe.sumelectzpe: -202.372304 hartree
zpe.sumelectthermal: -202.366113 hartree
zpe.sumelectthermalent: -202.365168 hartree
zpe.sumelectthermalfe: -202.404058 hartree
dipole: 1.1814 -0.3830 1.3617
dipole: 1.8430
quadrupole: -44.4120 -41.9301 -43.6863
quadrupole: 3.5841 -5.2724 2.1393
quadrupole: -1.0692 1.4127 -0.3435 3.5841 -5.2724 2.1393
hfenergy: -202.4225571 hartree
pointgroup: C01 [X(C3H3I1O1)]
dipole: 0.4784585 0.1913447 -0.5101081 debye
dipolederiv: -0.0707626 0.0265958 -0.0063033 0.0529564 0.1848522 0.0004524 0.0005502 -0.0014586 0.1963854 -0.7959902 -0.0758957 -0.198634 -0.2754826 -0.6260988 0.0907534 -0.2297801 0.0641742 -0.2775155 0.8702327 0.1030459 0.0743933 0.2254541 0.6113253 -0.0315746 0.1141599 0.0024415 0.3242658 -0.5398807 -0.0075645 -0.0323724 0.0679409 -0.1472326 -0.0050068 -0.0629168 0.0006898 -0.0290956 0.2829193 -0.1022708 -0.0024953 -0.1062219 -0.2599504 -0.0000192 0.0118944 0.0004154 -0.3113243 -0.0622004 0.0049675 -0.0403906 -0.0086865 -0.0630874 0.0995661 -0.0669007 0.1556348 -0.0425926 -0.0301216 0.0210534 0.0429888 -0.0187885 0.044287 -0.0579205 0.0517823 -0.105202 -0.0084292 0.3458035 0.0300684 0.1628136 0.0628281 0.2559049 -0.0962508 0.1812107 -0.116695 0.148306 unknown
polarizability: 103.4028399|-8.8725398|29.3529908|0.2152938|1.7199075|24.6958177 unknown
InChI: InChI=1S/C3H3IO/c4-2-1-3-5/h5H,3H2
charge 0 multiplicity 1
8 atoms
I  3.057268 -0.244789 -0.007214
O  -2.409205 -0.681743 -0.03838
C  -1.60674 0.557295 -0.014739
C  -0.152009 0.319753 -0.000125
C  1.064637 0.104251 -0.010105
H  -1.866654 1.209618 -0.875171
H  -1.922455 1.065704 0.911771
H  -2.093941 -1.250089 -0.787737
