program: Gaussian 09
title: 000074998
version: EM64L-G09RevD.01
frameworkgroup: C1[X(C26H25IN3O4)]
method: RPBEPBE
basis: SDD
operation: Freq
keyword: #p
keyword: freq=noraman
keyword: PBEPBE/SDD
title: #p freq=noraman PBEPBE/SDD
converged: YES YES NO NO
title: Mulliken charges:
elementType: I O O O O N N N C C C C C C C C C C C C C C C C C C C C C C C C C C H H H H H H H H H H H H H H H H H H H H H H H H H
charge: 0.113614 -0.260645 -0.421520 -0.223584 -0.226571 -0.146825 -0.446931 -0.141753 0.349700 0.056837 0.187437 0.245540 0.200927 0.360943 0.053070 0.487494 -0.631619 -0.587908 -0.342792 -0.528596 0.433627 -0.395070 0.115979 -0.331433 -0.321740 -0.232193 -0.634884 -0.633281 -0.221470 0.298752 -0.638642 -0.635471 0.096236 -0.929316 0.290113 0.334760 0.261817 0.287625 0.258576 0.273406 0.358929 0.301251 0.260248 0.261519 0.260315 0.236521 0.252897 0.242938 0.250899 0.259299 0.240837 0.254096 0.252220 0.252293 0.240520 0.251537 0.299194 0.345368 0.404913
chargesum: 1.00000
title: Mulliken charges with hydrogens summed into heavy atoms:
elementType: I O O O O N N N C C C C C C C C C C C C C C C C C C C C C C C C C C
charge: 0.113614 -0.260645 -0.016607 -0.223584 -0.226571 -0.146825 -0.088002 -0.141753 0.349700 0.056837 0.187437 0.245540 0.200927 0.360943 0.053070 0.487494 -0.341506 -0.253148 -0.080975 -0.240971 0.433627 -0.136494 0.115979 -0.058027 -0.020489 0.028055 0.123471 0.113453 0.037829 0.298752 0.108511 0.108879 0.096236 -0.284754
polarizability: 5.70379851e+02 9.03546670e+01 5.07651953e+02 2.33314549e+01 -9.85748334e+00 2.40799311e+02
1716.lowfreq: -7.1519 -4.9124 -2.7033 -0.0007 -0.0004 0.0005 11.4420 25.8196 28.5425
frequency: 11.0877 25.7477 28.5142 33.5167 35.6142 42.2394 52.4313 57.3302 68.9476 71.1330 75.8580 89.8431 101.8582 113.1993 119.3849 126.8619 128.8631 131.1504 143.1374 161.8418 176.4114 177.1059 185.4873 204.8674 232.8583 236.0616 255.0658 266.0290 278.1468 283.3500 300.1488 319.8336 322.8790 327.3380 356.2286 374.1362 388.0498 414.5743 421.0111 451.9677 456.8131 468.4827 489.7643 492.0499 498.7266 530.2354 537.1873 573.8042 581.9405 584.8853 591.5584 602.6265 607.2319 614.8740 618.2935 645.5683 662.3625 664.2967 677.3096 690.3672 693.0349 718.4726 730.5562 743.0599 755.7265 761.2622 770.0280 798.0900 819.7085 835.9631 843.3803 853.2885 857.2816 875.8009 898.6511 912.2219 919.5322 926.6393 931.4608 962.6123 970.8997 982.4387 1013.7293 1014.3199 1019.1698 1035.5856 1042.2596 1051.1517 1053.9948 1090.4881 1091.6746 1095.1340 1102.7432 1116.3436 1116.7624 1123.1886 1150.9436 1160.6506 1161.5522 1184.1271 1190.3209 1196.0168 1209.2348 1224.2408 1232.6424 1238.5224 1245.0802 1264.4275 1271.5696 1284.2311 1329.7729 1332.9585 1349.3865 1362.7718 1366.4657 1375.2905 1411.2389 1419.4061 1429.8127 1432.8994 1433.6222 1434.8823 1452.7570 1457.9090 1462.6860 1468.3835 1468.5173 1476.7229 1480.2716 1482.9628 1484.7327 1485.2072 1494.9906 1501.0474 1504.6877 1518.6694 1527.5479 1529.1357 1545.8800 1554.3793 1568.2443 1594.7411 1620.8305 1627.3572 1632.7830 1664.1890 2972.7258 2975.9095 2979.4238 2986.5189 3050.5302 3053.5027 3056.7370 3058.8722 3066.2899 3120.6371 3125.8330 3132.0305 3134.9288 3144.2908 3157.7246 3159.1190 3169.2984 3172.1502 3187.8266 3189.0354 3194.1117 3196.1777 3199.6642 3481.2315 3530.3029
redmass: 8.6324 10.6635 7.4505 7.4798 4.8615 3.3894 7.0869 2.6700 4.6551 4.8424 3.7382 4.6314 5.0049 4.0339 3.2205 2.4174 1.2792 1.9680 1.2109 1.7816 2.3824 3.0252 3.2379 3.9513 5.3055 5.1863 3.6975 4.3911 4.4610 4.7139 5.0135 4.3066 3.9069 4.5219 4.5967 4.2263 6.7668 3.5204 3.8784 5.9947 3.1732 3.3546 5.4379 4.0188 4.8062 4.4424 4.5862 4.7690 4.4192 3.9026 4.9195 2.7602 1.6478 6.7259 5.9154 4.2709 1.3200 3.2658 5.2459 4.1045 5.5599 5.8779 3.4067 6.1223 5.3863 2.9805 4.1460 1.6955 1.6369 4.4490 1.8853 1.6585 1.6914 3.6297 2.2319 2.6619 5.3516 1.5077 5.2906 2.6884 1.3207 1.3957 2.5719 1.7717 2.4644 3.1825 2.4905 1.6088 1.6044 1.4737 1.2358 1.2341 2.1472 1.3567 1.3496 2.1037 1.6701 1.7117 1.7599 1.0776 2.4775 1.2678 1.7529 2.8916 2.7314 2.3488 2.7275 1.9903 1.5076 2.0247 2.6538 2.4118 2.2490 4.5168 4.8362 3.4765 3.8493 3.3198 2.1990 1.1598 1.1453 1.1710 1.6531 1.3253 1.8004 1.0396 1.0400 2.0396 1.2254 1.4341 1.0479 1.0451 1.5362 1.4215 3.0111 2.5478 3.6735 3.4935 3.4702 3.8507 6.7252 6.1889 5.7228 8.6379 4.7230 6.8995 1.0366 1.0372 1.0382 1.0376 1.1011 1.1015 1.1026 1.0607 1.1022 1.0986 1.0985 1.0963 1.0966 1.0880 1.0917 1.0888 1.1063 1.0965 1.0945 1.0976 1.0918 1.0917 1.0918 1.0770 1.0646
irintensity: 0.2746 0.1957 0.7812 1.4648 2.0247 0.0721 1.4476 0.3727 1.3110 1.8500 2.2144 0.3091 2.0158 4.0987 1.8585 0.2561 1.7299 0.3289 1.9071 0.1948 1.1526 2.8471 0.0803 4.4731 1.9153 1.5097 0.0684 1.3529 1.1259 1.0342 0.9164 2.1945 2.8995 3.5034 0.3708 1.0207 17.0803 2.8092 7.6555 7.9112 3.0683 1.2776 8.1954 7.5146 20.7829 19.1203 7.7868 5.6026 5.7457 8.4150 25.3078 46.2476 22.5031 13.3302 5.6250 8.9889 31.6355 16.2266 4.6877 42.7111 42.3125 3.1895 0.5618 6.3220 0.9910 34.5484 5.6798 23.2631 15.8125 0.4709 11.6593 15.7973 64.4908 2.4614 23.1476 9.4367 4.0563 38.4187 2.9173 11.7316 0.5258 2.2375 139.5221 65.0398 28.4734 11.3566 3.7284 17.4294 19.3806 107.6476 0.6297 0.0571 71.3278 1.1941 0.9146 42.3519 19.3026 21.4869 34.1570 0.8305 1.7158 15.3431 44.3338 24.3230 40.6067 3.6829 27.2040 213.1132 6.5846 101.4912 81.8979 87.2629 27.2518 241.0750 127.4798 111.1954 324.1171 601.0994 16.5994 30.7096 36.7015 17.3158 5.7529 4.5320 70.8253 0.1691 0.4994 17.0356 8.8355 12.4142 30.0906 37.2676 66.9873 135.8810 213.8166 240.1450 21.6369 608.4036 2.5773 34.3193 19.7450 26.8553 832.1781 294.8583 794.5369 222.8494 38.8196 47.2644 112.4663 63.3229 11.7304 16.0368 28.8224 4.6115 18.5441 2.1225 1.8528 28.3440 30.2267 0.4464 3.6308 1.6099 0.6009 5.5663 5.3354 3.1013 1.1476 27.4743 0.0086 120.4414 85.8697
temp: 298.150 k
press: 1.00000 atm
elementType: 53 8 8 8 8 7 7 7 6 6 6 6 6 6 6 6 6 6 6 6 6 6 6 6 6 6 6 6 6 6 6 6 6 6 1 1 1 1 1 1 1 1 1 1 1 1 1 1 1 1 1 1 1 1 1 1 1 1 1
symmnumber: 1
zpe: 1205218.0 jmol-1
zpe.correction: 0.459043 hartree
zpe.thermalcorrener: 0.491904 hartree
zpe.thermalcorrenthalpy: 0.492848 hartree
zpe.thermalcorrgfe: 0.390922 hartree
zpe.sumelectzpe: -1479.830552 hartree
zpe.sumelectthermal: -1479.797692 hartree
zpe.sumelectthermalent: -1479.796747 hartree
zpe.sumelectthermalfe: -1479.898673 hartree
dipole: -11.3777 1.1383 1.9880
dipole: 11.6060
quadrupole: -112.7519 -123.3292 -193.5696
quadrupole: 9.2333 9.8047 -7.3225
quadrupole: 30.4650 19.8877 -50.3527 9.2333 9.8047 -7.3225
hfenergy: -1480.289595 hartree
pointgroup: C01 [X(C26H25I1N3O4)]
dipole: 4.0117616 1.8624233 -1.134389 debye
polarizability: 622.270505|-47.3632947|458.3306481|7.230905|-1.838262|238.2299618 unknown
InChI: InChI=1S/C26H25IN3O4/c1-29(2)15-9-10-19-21(12-15)34-22-13-16(30(3)4)11-20(28-23(31)14-27)25(22)24(19)17-7-5-6-8-18(17)26(32)33/h5-13,28,32H,14H2,1-4H3
charge 1 multiplicity 1
59 atoms
I  -4.310914 -3.211805 1.465794
O  1.379142 2.306559 0.05873
O  -0.09683 -3.464383 2.678393
O  -4.945185 0.09255 -0.522549
O  0.065134 -1.187519 2.251942
N  -2.960914 4.320952 -0.034154
N  -2.666903 -0.524029 -0.397247
N  5.942885 0.772314 0.15873
C  0.358776 -0.326028 -0.325795
C  -0.550328 0.772032 -0.243392
C  1.771724 -0.091316 -0.236745
C  -0.003095 2.104629 -0.060668
C  2.269792 1.23617 -0.020718
C  -2.016666 0.726889 -0.295355
C  -0.048298 -1.747649 -0.622735
C  -2.174341 3.193136 -0.087566
C  -0.750626 3.272095 0.011649
C  -2.777843 1.898205 -0.233735
C  2.769693 -1.120238 -0.332187
C  3.621283 1.548493 0.110065
C  4.597377 0.50503 0.02572
C  4.124313 -0.844062 -0.208569
C  -0.185716 -2.74847 0.390697
C  -0.188478 -2.13147 -1.982073
C  -0.471263 -4.091193 0.029867
C  -0.47663 -3.470487 -2.332719
C  -4.434441 4.217717 -0.127562
C  -2.3438 5.651655 0.139664
C  -0.617164 -4.453457 -1.325009
C  -4.04167 -0.790483 -0.481457
C  6.404316 2.154041 0.401631
C  6.943324 -0.311371 0.058308
C  -0.058747 -2.362664 1.828142
C  -4.380945 -2.272881 -0.544235
H  -0.21961 4.214678 0.147843
H  -3.860389 1.792498 -0.288023
H  2.454607 -2.152711 -0.507881
H  3.89593 2.591522 0.273999
H  4.839726 -1.665108 -0.289175
H  -0.066513 -1.375048 -2.764219
H  -2.061935 -1.349167 -0.380535
H  -0.578861 -4.833114 0.825008
H  -0.580758 -3.743368 -3.387882
H  -4.851828 3.632454 0.712436
H  -4.743146 3.73962 -1.074741
H  -4.86992 5.226523 -0.094506
H  -1.798375 5.72012 1.099852
H  -3.128912 6.420884 0.137307
H  -1.640984 5.877134 -0.6841
H  -0.83602 -5.49162 -1.593143
H  7.49964 2.163297 0.493989
H  5.978148 2.55961 1.338624
H  6.124586 2.824039 -0.433495
H  6.788862 -1.07845 0.839968
H  7.948822 0.111704 0.194071
H  6.911295 -0.801032 -0.932894
H  -3.687956 -2.862764 -1.164772
H  -5.419026 -2.395017 -0.876909
H  -0.032747 -3.165344 3.625218
