program: Orca
programVersion: 5.0.2
elementType: Cl Cl O O O N C C C C C C C C C C C C C C C C C C C C C C H H H H H H H H H H H H H H H H H H H
charge: 0
multiplicity: 1
keywords: wb97x-d3
keywords: def2-TZVPP
keywords: def2/J RIJCOSX
keywords: DEFGRID2
keywords: scfconv7
keywords: smallprint printgap noloewdin
keywords: NOSOSCF
formula: C22H19Cl2NO3
InChI: InChI=1/C22H19Cl2NO3/c1-22(2)17(12-19(23)24)20(22)21(26)28-18(13-25)14-7-6-10-16(11-14)27-15-8-4-3-5-9-15/h3-12,17-18,20H,1-2H3
47 atoms
Cl -4.105778 -0.094658 1.07332
Cl -4.698647 0.137905 -1.739281
O  1.979606 -1.741134 -0.254744
O  0.859209 -1.598471 1.686507
O  2.083495 3.465173 0.370866
N  5.022373 -3.03133 -0.29163
C  -1.265605 -3.288435 0.100248
C  -1.676508 -1.846572 0.139944
C  -0.281101 -2.216969 -0.326923
C  -1.110209 -4.008464 1.416392
C  -1.771438 -4.182396 -1.00584
C  -2.608635 -1.270784 -0.836699
C  0.869004 -1.825421 0.502707
C  -3.652952 -0.510353 -0.534288
C  3.190452 -1.283387 0.348792
C  3.486113 0.117742 -0.130451
C  4.217774 -2.255078 -0.023957
C  2.684642 1.136065 0.374797
C  4.46749 0.40113 -1.069763
C  2.847158 2.429609 -0.0949
C  4.645235 1.710001 -1.498605
C  3.831843 2.726721 -1.027653
C  0.73802 3.266674 0.578972
C  0.175742 3.857743 1.699945
C  -0.046982 2.553327 -0.319517
C  -1.189262 3.735034 1.921476
C  -1.407403 2.428958 -0.078267
C  -1.984924 3.016735 1.040161
H  -1.721194 -1.421998 1.136459
H  -0.103882 -2.163772 -1.39483
H  -0.315611 -4.754321 1.362034
H  -2.038416 -4.533253 1.647395
H  -0.898894 -3.344332 2.250641
H  -1.135327 -5.064342 -1.092951
H  -1.785662 -3.692632 -1.978604
H  -2.783927 -4.524491 -0.78524
H  -2.43499 -1.472653 -1.887159
H  3.113235 -1.298382 1.439667
H  1.936777 0.920164 1.128038
H  5.098787 -0.380117 -1.47268
H  5.413969 1.935685 -2.225086
H  3.957891 3.74297 -1.378156
H  0.799358 4.411519 2.390253
H  0.388376 2.101348 -1.201708
H  -1.627524 4.197738 2.795916
H  -2.018942 1.879768 -0.782283
H  -3.046363 2.917009 1.221215
elementType: Cl O N C H
totalener: -2050.67219358 hartree
nucrepener: 2858.79876791 hartree
electener: -4909.47096150 hartree
oneelecener: -8492.56950145 hartree
twoeener: 3583.09853995 hartree
cpcmener: -0.03371695 hartree
kineticenergy: 2044.44429636 hartree
xcener: -151.860873116218 hartree
chargesum: -0.0000000
charge: -0.058007 -0.066942 -0.279349 -0.467293 -0.340878 -0.096886 0.097990 0.029789 -0.094650 -0.272480 -0.263589 -0.211525 0.428817 0.049472 0.436343 -0.038776 -0.225925 -0.141786 -0.201343 0.229133 -0.114769 -0.233795 0.294232 -0.256692 -0.188854 -0.122576 -0.145877 -0.194130 0.084168 0.099758 0.103822 0.099039 0.094354 0.100017 0.092672 0.101582 0.137469 0.139922 0.155794 0.139799 0.163442 0.151185 0.148269 0.154570 0.160395 0.175439 0.148650
qa: -0.0580 -0.0669 -0.2793 -0.4673 -0.3409 -0.0969 0.0980 0.0298 -0.0947 -0.2725 -0.2636 -0.2115 0.4288 0.0495 0.4363 -0.0388 -0.2259 -0.1418 -0.2013 0.2291 -0.1148 -0.2338 0.2942 -0.2567 -0.1889 -0.1226 -0.1459 -0.1941 0.0842 0.0998 0.1038 0.0990 0.0944 0.1000 0.0927 0.1016 0.1375 0.1399 0.1558 0.1398 0.1634 0.1512 0.1483 0.1546 0.1604 0.1754 0.1487
va: 1.2664 1.2319 2.1194 2.0379 2.0648 3.1117 3.7520 3.8329 3.8781 3.9066 3.9118 3.8980 4.1416 4.1794 3.7084 3.7945 4.0796 3.8820 3.9516 3.7717 3.9191 4.0217 3.6618 4.0204 3.9013 3.9148 3.8363 3.9144 1.0451 1.0351 0.9989 1.0000 1.0171 1.0015 1.0044 1.0006 1.0137 1.0277 1.0121 1.0139 0.9880 1.0035 1.0070 1.0005 0.9882 0.9751 1.0073
dispcorr: -0.026873033 hartree
energy: -2050.699066615461
dipole: 12.38088 -13.27727 -0.89639 -10.21352 10.21846 0.00494 1.41873 -2.21766 -0.79893
magnitude: 1.20077 au
magnitude: 3.05210 debye
