program: Orca
programVersion: 5.0.2
elementType: Cl Cl O O O N C C C C C C C C C C C C C C C C C C C C C C H H H H H H H H H H H H H H H H H H H
charge: 0
multiplicity: 1
keywords: wb97x-d3
keywords: def2-TZVPP
keywords: def2/J RIJCOSX
keywords: DEFGRID2
keywords: scfconv7
keywords: smallprint printgap noloewdin
keywords: NOSOSCF
formula: C22H19Cl2NO3
InChI: InChI=1/C22H19Cl2NO3/c1-22(2)17(12-19(23)24)20(22)21(26)28-18(13-25)14-7-6-10-16(11-14)27-15-8-4-3-5-9-15/h3-12,17-18,20H,1-2H3
47 atoms
Cl -2.138867 -1.255992 -2.574437
Cl -3.370196 -3.274675 -4.234932
O  0.892585 -1.710202 0.47833
O  -1.09169 -1.155788 1.346667
O  0.838959 4.328618 0.593193
N  4.038128 -0.868352 1.030639
C  -1.655804 -4.215785 0.610162
C  -2.374602 -3.268087 -0.284469
C  -0.890843 -3.083183 -0.065638
C  -1.925824 -4.169016 2.092421
C  -1.328316 -5.596929 0.100513
C  -2.853534 -3.657366 -1.628957
C  -0.427491 -1.898048 0.667811
C  -2.795644 -2.843126 -2.672873
C  1.447704 -0.521758 1.011925
C  1.123875 0.699503 0.176934
C  2.895119 -0.739252 1.021867
C  1.114895 1.938984 0.799906
C  0.88355 0.586876 -1.186313
C  0.884677 3.07859 0.040391
C  0.617033 1.73219 -1.921664
C  0.626298 2.980626 -1.319732
C  1.712597 4.678424 1.594212
C  1.227971 5.531725 2.5751
C  3.037624 4.260176 1.607509
C  2.078781 5.966559 3.581156
C  3.872056 4.691438 2.628789
C  3.400114 5.543189 3.618578
H  -2.998411 -2.533868 0.219223
H  -0.23601 -3.396182 -0.870822
H  -1.036172 -4.457371 2.654638
H  -2.717186 -4.876861 2.342808
H  -2.244207 -3.188831 2.440491
H  -1.092168 -5.606772 -0.963657
H  -2.171013 -6.270783 0.263785
H  -0.468813 -6.005458 0.633639
H  -3.289393 -4.639883 -1.769215
H  1.137263 -0.363939 2.050316
H  1.287725 2.006859 1.867539
H  0.899061 -0.374875 -1.680622
H  0.417283 1.653932 -2.981864
H  0.43293 3.874006 -1.899319
H  0.195621 5.856475 2.546866
H  3.425248 3.608078 0.835282
H  1.699637 6.633892 4.343901
H  4.902008 4.359877 2.642788
H  4.057736 5.876194 4.410237
elementType: Cl O N C H
totalener: -2050.67043397 hartree
nucrepener: 2759.42959677 hartree
electener: -4810.10003074 hartree
oneelecener: -8294.56370203 hartree
twoeener: 3484.46367130 hartree
cpcmener: -0.03612623 hartree
kineticenergy: 2044.46220279 hartree
xcener: -151.863427904274 hartree
chargesum: 0.0000000
charge: -0.057052 -0.056746 -0.283374 -0.459864 -0.337360 -0.101802 0.132881 -0.037437 -0.119213 -0.266847 -0.278060 -0.216154 0.387101 0.080074 0.406810 0.033727 -0.217868 -0.216314 -0.221626 0.279442 -0.125206 -0.224649 0.302982 -0.260867 -0.200587 -0.119942 -0.144744 -0.193310 0.114637 0.116546 0.103131 0.098895 0.091681 0.094643 0.103598 0.100028 0.143330 0.146180 0.148835 0.151450 0.160024 0.151242 0.148494 0.157690 0.161311 0.162793 0.161496
qa: -0.0571 -0.0567 -0.2834 -0.4599 -0.3374 -0.1018 0.1329 -0.0374 -0.1192 -0.2668 -0.2781 -0.2162 0.3871 0.0801 0.4068 0.0337 -0.2179 -0.2163 -0.2216 0.2794 -0.1252 -0.2246 0.3030 -0.2609 -0.2006 -0.1199 -0.1447 -0.1933 0.1146 0.1165 0.1031 0.0989 0.0917 0.0946 0.1036 0.1000 0.1433 0.1462 0.1488 0.1514 0.1600 0.1512 0.1485 0.1577 0.1613 0.1628 0.1615
va: 1.2847 1.2501 2.1118 2.0432 2.0712 3.1101 3.7423 3.8773 3.8002 3.8938 3.9126 3.9064 4.1533 4.1798 3.7126 3.6374 4.0668 3.9905 3.9401 3.7135 3.9029 4.0134 3.6662 4.0076 3.9046 3.8761 3.8834 3.9036 1.0237 1.0224 0.9991 1.0011 1.0156 0.9990 0.9993 1.0027 1.0073 1.0196 1.0039 1.0173 0.9917 1.0037 1.0076 0.9973 0.9878 0.9891 0.9893
dispcorr: -0.025092854 hartree
energy: -2050.695526824370
dipole: 9.42300 -10.45876 -1.03576 -0.64881 -0.55522 -1.20403 25.73435 -25.37446 0.35989
magnitude: 1.62850 au
magnitude: 4.13931 debye
