program: Orca
programVersion: 5.0.2
elementType: Cl Cl O O O N C C C C C C C C C C C C C C C C C C C C C C H H H H H H H H H H H H H H H H H H H
charge: 0
multiplicity: 1
keywords: wb97x-d3
keywords: def2-TZVPP
keywords: def2/J RIJCOSX
keywords: DEFGRID2
keywords: scfconv7
keywords: smallprint printgap noloewdin
keywords: NOSOSCF
formula: C22H19Cl2NO3
InChI: InChI=1/C22H19Cl2NO3/c1-22(2)17(12-19(23)24)20(22)21(26)28-18(13-25)14-7-6-10-16(11-14)27-15-8-4-3-5-9-15/h3-12,17-18,20H,1-2H3
47 atoms
Cl -2.971939 -0.251962 2.675137
Cl -4.833105 0.375334 0.564505
O  1.656694 -1.687685 -1.180472
O  1.367669 -2.173595 0.981875
O  1.993891 3.340707 -0.105569
N  4.159414 -1.175291 -3.265142
C  -1.321037 -3.426032 -0.101366
C  -1.587471 -2.089992 0.524041
C  -0.49846 -2.22469 -0.528255
C  -0.724289 -4.503274 0.770047
C  -2.266646 -3.973316 -1.143381
C  -2.779151 -1.300819 0.195208
C  0.904444 -2.04305 -0.123347
C  -3.431581 -0.509377 1.036763
C  3.024266 -1.396621 -0.9216
C  3.211876 -0.112234 -0.148286
C  3.641868 -1.280726 -2.243527
C  2.491044 1.017149 -0.515123
C  4.105934 -0.072766 0.910495
C  2.657383 2.187234 0.211147
C  4.28321 1.114449 1.606463
C  3.55545 2.244093 1.26956
C  0.704798 3.271982 -0.58048
C  -0.254829 2.470677 0.026263
C  0.378945 4.080679 -1.658444
C  -1.550783 2.481276 -0.466941
C  -0.925237 4.087967 -2.134421
C  -1.893136 3.286344 -1.545782
H  -1.220395 -1.987105 1.538769
H  -0.734706 -1.839388 -1.513204
H  -0.080461 -5.16195 0.184875
H  -1.527232 -5.113578 1.186426
H  -0.146139 -4.114551 1.604754
H  -3.139677 -4.421107 -0.665897
H  -1.770066 -4.752119 -1.723692
H  -2.616124 -3.218419 -1.845918
H  -3.164761 -1.358367 -0.815407
H  3.515787 -2.224925 -0.401138
H  1.808683 0.98311 -1.356136
H  4.657073 -0.960918 1.19135
H  4.978858 1.156267 2.433595
H  3.680591 3.165934 1.822814
H  -0.003507 1.845796 0.874236
H  1.137412 4.701594 -2.11799
H  -2.299694 1.859865 0.004589
H  -1.179896 4.720243 -2.974734
H  -2.907313 3.289662 -1.921884
elementType: Cl O N C H
totalener: -2050.67320723 hartree
nucrepener: 2868.45703410 hartree
electener: -4919.13024134 hartree
oneelecener: -8512.14529463 hartree
twoeener: 3593.01505330 hartree
cpcmener: -0.03693172 hartree
kineticenergy: 2044.45242810 hartree
xcener: -151.862420818779 hartree
chargesum: -0.0000000
charge: -0.060694 -0.069383 -0.285973 -0.463244 -0.340182 -0.101026 0.084053 0.048122 -0.067536 -0.266665 -0.270160 -0.234617 0.395301 0.072223 0.430371 0.012515 -0.220592 -0.191936 -0.207480 0.240616 -0.116419 -0.232114 0.293768 -0.227120 -0.253939 -0.095284 -0.105867 -0.225980 0.081067 0.102078 0.101980 0.099442 0.093735 0.102415 0.099439 0.094286 0.133795 0.145577 0.150650 0.150334 0.162358 0.151405 0.150487 0.148949 0.174405 0.160930 0.155910
qa: -0.0607 -0.0694 -0.2860 -0.4632 -0.3402 -0.1010 0.0841 0.0481 -0.0675 -0.2667 -0.2702 -0.2346 0.3953 0.0722 0.4304 0.0125 -0.2206 -0.1919 -0.2075 0.2406 -0.1164 -0.2321 0.2938 -0.2271 -0.2539 -0.0953 -0.1059 -0.2260 0.0811 0.1021 0.1020 0.0994 0.0937 0.1024 0.0994 0.0943 0.1338 0.1456 0.1507 0.1503 0.1624 0.1514 0.1505 0.1489 0.1744 0.1609 0.1559
va: 1.2617 1.2351 2.1269 2.0441 2.0682 3.1092 3.7718 3.8322 3.8308 3.9042 3.9118 3.9359 4.1665 4.1768 3.6997 3.6023 4.0876 3.9247 3.9686 3.7609 3.8964 4.0030 3.6872 3.9510 4.0128 3.7932 3.8685 3.9508 1.0485 1.0313 0.9993 0.9999 1.0180 1.0004 1.0009 1.0054 1.0174 1.0154 1.0142 1.0013 0.9879 1.0037 1.0059 1.0066 0.9755 0.9877 0.9949
dispcorr: -0.026569042 hartree
energy: -2050.699776273046
dipole: 9.56335 -10.61181 -1.04845 -12.99068 11.80047 -1.19022 -8.32951 8.61523 0.28573
magnitude: 1.61168 au
magnitude: 4.09656 debye
