program: Orca
programVersion: 5.0.2
elementType: Cl Cl O O O N C C C C C C C C C C C C C C C C C C C C C C H H H H H H H H H H H H H H H H H H H
charge: 0
multiplicity: 1
keywords: wb97x-d3
keywords: def2-TZVPP
keywords: def2/J RIJCOSX
keywords: DEFGRID2
keywords: scfconv7
keywords: smallprint printgap noloewdin
keywords: NOSOSCF
formula: C22H19Cl2NO3
InChI: InChI=1/C22H19Cl2NO3/c1-22(2)17(12-19(23)24)20(22)21(26)28-18(13-25)14-7-6-10-16(11-14)27-15-8-4-3-5-9-15/h3-12,17-18,20H,1-2H3
47 atoms
Cl -2.263984 0.057613 2.803383
Cl -4.568622 0.471326 1.120469
O  1.627327 -1.740129 -1.207384
O  1.468696 -2.302752 0.94778
O  1.701429 3.265301 -0.072997
N  4.062492 -1.095088 -3.350825
C  -1.30075 -3.48212 0.043664
C  -1.482929 -2.159715 0.719974
C  -0.49218 -2.288956 -0.431177
C  -0.649756 -4.594595 0.827688
C  -2.346215 -3.981788 -0.924019
C  -2.689818 -1.345536 0.538359
C  0.937254 -2.130869 -0.120622
C  -3.108989 -0.407061 1.377451
C  2.989668 -1.392034 -0.987382
C  3.124389 -0.110262 -0.198099
C  3.570037 -1.239153 -2.321376
C  2.344268 0.984614 -0.54965
C  4.001419 -0.046265 0.872876
C  2.427126 2.14299 0.208708
C  4.098629 1.132637 1.599276
C  3.308278 2.224133 1.281305
C  0.481445 3.168026 -0.700436
C  0.226869 4.066217 -1.725998
C  -0.485981 2.25729 -0.292244
C  -1.012762 4.054607 -2.350785
C  -1.713473 2.247092 -0.938104
C  -1.983503 3.140894 -1.966267
H  -1.012909 -2.084508 1.693828
H  -0.798788 -1.874954 -1.384477
H  -0.062861 -5.238494 0.170799
H  -1.423655 -5.211423 1.286956
H  -0.002195 -4.239479 1.625467
H  -3.18745 -4.417074 -0.382104
H  -1.923238 -4.75975 -1.560885
H  -2.733017 -3.202306 -1.578983
H  -3.29906 -1.5195 -0.33993
H  3.533525 -2.201028 -0.489351
H  1.677005 0.927718 -1.400956
H  4.597546 -0.908503 1.142038
H  4.78038 1.195793 2.436647
H  3.370646 3.13678 1.860069
H  0.9902 4.77259 -2.02688
H  -0.294592 1.565327 0.519013
H  -1.212331 4.759595 -3.147095
H  -2.467251 1.535669 -0.629709
H  -2.945666 3.126244 -2.460289
elementType: Cl O N C H
totalener: -2050.67267093 hartree
nucrepener: 2894.00841546 hartree
electener: -4944.68108638 hartree
oneelecener: -8563.27601446 hartree
twoeener: 3618.59492807 hartree
cpcmener: -0.03680038 hartree
kineticenergy: 2044.45141617 hartree
xcener: -151.863264131566 hartree
chargesum: 0.0000000
charge: -0.060120 -0.064810 -0.287549 -0.463478 -0.335560 -0.100940 0.090930 0.027556 -0.054192 -0.267878 -0.280077 -0.201576 0.387529 0.047235 0.430674 0.017108 -0.221873 -0.221443 -0.215080 0.279325 -0.107106 -0.247059 0.303104 -0.262311 -0.213655 -0.109723 -0.098796 -0.213638 0.083042 0.103568 0.102252 0.099180 0.093797 0.105541 0.100014 0.095276 0.134676 0.144744 0.149534 0.150242 0.162134 0.150427 0.147717 0.146717 0.161174 0.153943 0.159426
qa: -0.0601 -0.0648 -0.2875 -0.4635 -0.3356 -0.1009 0.0909 0.0276 -0.0542 -0.2679 -0.2801 -0.2016 0.3875 0.0472 0.4307 0.0171 -0.2219 -0.2214 -0.2151 0.2793 -0.1071 -0.2471 0.3031 -0.2623 -0.2137 -0.1097 -0.0988 -0.2136 0.0830 0.1036 0.1023 0.0992 0.0938 0.1055 0.1000 0.0953 0.1347 0.1447 0.1495 0.1502 0.1621 0.1504 0.1477 0.1467 0.1612 0.1539 0.1594
va: 1.2609 1.2384 2.1265 2.0434 2.0805 3.1099 3.7945 3.8396 3.7990 3.9001 3.9149 3.8799 4.1779 4.1883 3.7042 3.6057 4.0882 3.9391 3.9709 3.7437 3.8877 4.0044 3.7141 4.0180 3.9342 3.8686 3.7980 3.9709 1.0490 1.0300 0.9992 0.9999 1.0177 0.9992 1.0011 1.0042 1.0186 1.0161 1.0142 1.0016 0.9877 1.0049 1.0075 1.0048 0.9872 1.0048 0.9922
dispcorr: -0.027219305 hartree
energy: -2050.699890231093
dipole: 6.56110 -7.80966 -1.24856 -14.57388 13.34221 -1.23167 -10.01929 10.30650 0.28720
magnitude: 1.77719 au
magnitude: 4.51726 debye
