program: Orca
programVersion: 5.0.2
elementType: Cl Cl O O O N C C C C C C C C C C C C C C C C C C C C C C H H H H H H H H H H H H H H H H H H H
charge: 0
multiplicity: 1
keywords: wb97x-d3
keywords: def2-TZVPP
keywords: def2/J RIJCOSX
keywords: DEFGRID2
keywords: scfconv7
keywords: smallprint printgap noloewdin
keywords: NOSOSCF
formula: C22H19Cl2NO3
InChI: InChI=1/C22H19Cl2NO3/c1-22(2)17(12-19(23)24)20(22)21(26)28-18(13-25)14-7-6-10-16(11-14)27-15-8-4-3-5-9-15/h3-12,17-18,20H,1-2H3
47 atoms
Cl -4.258658 -0.932386 -0.791558
Cl -4.507924 -2.358668 -3.287093
O  1.778452 -2.180694 -0.268412
O  0.341835 -1.529737 1.313936
O  2.380134 3.291508 1.784908
N  5.015317 -1.944285 -0.850124
C  -1.244861 -4.082252 0.403864
C  -1.829598 -2.870863 -0.257295
C  -0.332309 -3.129484 -0.342711
C  -1.247992 -4.13157 1.911592
C  -1.420703 -5.443558 -0.225131
C  -2.615673 -2.955767 -1.492854
C  0.581105 -2.203605 0.343362
C  -3.649636 -2.184498 -1.80364
C  2.745745 -1.28587 0.266162
C  2.433161 0.162824 -0.028086
C  4.006574 -1.666043 -0.372598
C  2.498753 1.089033 1.000355
C  2.090534 0.558586 -1.315583
C  2.240831 2.427467 0.735433
C  1.825638 1.8963 -1.561626
C  1.904552 2.840242 -0.547175
C  1.62059 4.437507 1.836174
C  0.24239 4.403753 1.665501
C  2.273914 5.624179 2.129622
C  -0.481476 5.580786 1.787322
C  1.535136 6.792435 2.260633
C  0.15867 6.777211 2.084908
H  -2.108134 -2.077089 0.426268
H  0.034486 -3.500405 -1.29253
H  -2.131424 -4.675431 2.249743
H  -1.273193 -3.149942 2.378227
H  -0.371611 -4.664912 2.28334
H  -1.306054 -5.435378 -1.307891
H  -2.408692 -5.844013 0.007588
H  -0.679341 -6.136611 0.174999
H  -2.330003 -3.701753 -2.224485
H  2.869595 -1.436732 1.343533
H  2.754098 0.776803 2.005851
H  2.034864 -0.161595 -2.121986
H  1.563581 2.21711 -2.560809
H  1.709993 3.882109 -0.765861
H  -0.265003 3.472825 1.445269
H  3.348407 5.632649 2.260713
H  -1.555163 5.558043 1.6552
H  2.043498 7.718681 2.494025
H  -0.413192 7.690221 2.182287
elementType: Cl O N C H
totalener: -2050.67279821 hartree
nucrepener: 2695.22554135 hartree
electener: -4745.89833956 hartree
oneelecener: -8166.05501282 hartree
twoeener: 3420.15667326 hartree
cpcmener: -0.03734739 hartree
kineticenergy: 2044.45282548 hartree
xcener: -151.861045725496 hartree
chargesum: 0.0000000
charge: -0.056785 -0.061228 -0.284910 -0.466230 -0.336801 -0.102036 0.091075 0.025477 -0.067160 -0.268571 -0.269643 -0.197413 0.402685 0.039881 0.421772 0.010431 -0.218238 -0.227258 -0.223549 0.266847 -0.148501 -0.172802 0.267019 -0.183593 -0.236949 -0.148972 -0.132534 -0.179168 0.081820 0.098448 0.098573 0.093748 0.102778 0.094123 0.102530 0.099197 0.131707 0.143993 0.137502 0.151919 0.163369 0.160128 0.161601 0.149186 0.162785 0.161831 0.161919
qa: -0.0568 -0.0612 -0.2849 -0.4662 -0.3368 -0.1020 0.0911 0.0255 -0.0672 -0.2686 -0.2696 -0.1974 0.4027 0.0399 0.4218 0.0104 -0.2182 -0.2273 -0.2235 0.2668 -0.1485 -0.1728 0.2670 -0.1836 -0.2369 -0.1490 -0.1325 -0.1792 0.0818 0.0984 0.0986 0.0937 0.1028 0.0941 0.1025 0.0992 0.1317 0.1440 0.1375 0.1519 0.1634 0.1601 0.1616 0.1492 0.1628 0.1618 0.1619
va: 1.2688 1.2438 2.1310 2.0445 2.0630 3.1098 3.7359 3.8775 3.8429 3.9034 3.9114 3.8997 4.1586 4.2108 3.6999 3.6219 4.0823 4.0675 3.9709 3.7595 3.9232 3.8996 3.6843 3.9147 4.0043 3.8839 3.8816 3.8918 1.0465 1.0330 0.9998 1.0184 0.9989 1.0054 1.0003 1.0009 1.0185 1.0164 1.0181 1.0097 0.9897 0.9947 0.9948 1.0063 0.9891 0.9880 0.9890
dispcorr: -0.022812812 hartree
energy: -2050.695611027028
dipole: 13.53365 -14.75256 -1.21891 0.90056 -1.19657 -0.29601 15.43925 -15.38229 0.05696
magnitude: 1.25563 au
magnitude: 3.19156 debye
