program: Orca
programVersion: 5.0.2
elementType: Cl Cl O O O N C C C C C C C C C C C C C C C C C C C C C C H H H H H H H H H H H H H H H H H H H
charge: 0
multiplicity: 1
keywords: wb97x-d3
keywords: def2-TZVPP
keywords: def2/J RIJCOSX
keywords: DEFGRID2
keywords: scfconv7
keywords: smallprint printgap noloewdin
keywords: NOSOSCF
formula: C22H19Cl2NO3
InChI: InChI=1/C22H19Cl2NO3/c1-22(2)17(12-19(23)24)20(22)21(26)28-18(13-25)14-7-6-10-16(11-14)27-15-8-4-3-5-9-15/h3-12,17-18,20H,1-2H3
47 atoms
Cl -3.769951 -2.918563 2.472189
Cl -5.579749 -2.202034 0.343984
O  1.460019 -1.621007 -1.107574
O  1.084701 -2.325741 0.980784
O  0.775638 3.429667 -0.71007
N  4.105234 -0.698044 -2.846044
C  -0.895413 -4.218732 -0.654015
C  -1.632612 -3.212796 0.183332
C  -0.528419 -2.749409 -0.743125
C  0.006944 -5.194006 0.059218
C  -1.551839 -4.8070 -1.87823
C  -3.013997 -2.816371 -0.116044
C  0.723187 -2.231917 -0.16534
C  -3.980134 -2.668797 0.781657
C  2.680595 -1.021857 -0.679488
C  2.441545 0.298102 0.010863
C  3.46332 -0.842713 -1.903047
C  1.757661 1.304208 -0.661545
C  2.881605 0.4928 1.310987
C  1.505512 2.503629 -0.017459
C  2.624584 1.702504 1.941993
C  1.93121 2.709728 1.290934
C  1.055487 4.768492 -0.577707
C  2.358084 5.251115 -0.555167
C  -0.025601 5.636237 -0.53253
C  2.569276 6.620175 -0.475875
C  0.20161 7.003727 -0.466431
C  1.496768 7.501394 -0.431212
H  -1.366587 -3.226538 1.234119
H  -0.835294 -2.261748 -1.661431
H  0.412218 -4.805467 0.991042
H  0.84198 -5.486376 -0.579794
H  -0.555197 -6.097557 0.300323
H  -2.217657 -5.624487 -1.596855
H  -0.793578 -5.212811 -2.549521
H  -2.132365 -4.079225 -2.443221
H  -3.274381 -2.625865 -1.150407
H  3.247704 -1.695026 -0.028984
H  1.416255 1.163447 -1.680989
H  3.415833 -0.292449 1.829519
H  2.95588 1.859898 2.959534
H  1.723839 3.640663 1.802705
H  3.202298 4.574945 -0.603943
H  -1.034452 5.244341 -0.555372
H  3.583106 6.997752 -0.456755
H  -0.64205 7.680464 -0.43481
H  1.669746 8.567539 -0.373248
elementType: Cl O N C H
totalener: -2050.67307462 hartree
nucrepener: 2675.22219647 hartree
electener: -4725.89527109 hartree
oneelecener: -8126.13399424 hartree
twoeener: 3400.23872315 hartree
cpcmener: -0.03679365 hartree
kineticenergy: 2044.45452853 hartree
xcener: -151.860693496834 hartree
chargesum: 0.0000000
charge: -0.057747 -0.061249 -0.282972 -0.465935 -0.338018 -0.101212 0.085859 0.030904 -0.085323 -0.262880 -0.262347 -0.203600 0.411632 0.039041 0.430409 0.001295 -0.222390 -0.237397 -0.190725 0.240771 -0.130742 -0.178893 0.277624 -0.185083 -0.244753 -0.151697 -0.129300 -0.183524 0.078205 0.102200 0.092718 0.102167 0.099626 0.101661 0.099245 0.092899 0.135691 0.143706 0.138623 0.151227 0.164392 0.161284 0.159966 0.148913 0.162797 0.161276 0.161654
qa: -0.0577 -0.0612 -0.2830 -0.4659 -0.3380 -0.1012 0.0859 0.0309 -0.0853 -0.2629 -0.2623 -0.2036 0.4116 0.0390 0.4304 0.0013 -0.2224 -0.2374 -0.1907 0.2408 -0.1307 -0.1789 0.2776 -0.1851 -0.2448 -0.1517 -0.1293 -0.1835 0.0782 0.1022 0.0927 0.1022 0.0996 0.1017 0.0992 0.0929 0.1357 0.1437 0.1386 0.1512 0.1644 0.1613 0.1600 0.1489 0.1628 0.1613 0.1617
va: 1.2676 1.2439 2.1359 2.0453 2.0613 3.1091 3.7486 3.8598 3.8445 3.9080 3.9058 3.8966 4.1739 4.2070 3.7028 3.6141 4.0805 4.0812 3.9539 3.7876 3.8988 3.9183 3.6797 3.8991 4.0021 3.8880 3.8831 3.8944 1.0500 1.0319 1.0167 0.9996 1.0001 1.0009 1.0017 1.0050 1.0156 1.0141 1.0251 1.0039 0.9892 0.9932 0.9956 1.0069 0.9892 0.9881 0.9892
dispcorr: -0.022719550 hartree
energy: -2050.695794171286
dipole: 22.30585 -22.41389 -0.10804 5.60649 -5.65355 -0.04706 -8.13813 8.58146 0.44333
magnitude: 0.45872 au
magnitude: 1.16598 debye
