program: Orca
programVersion: 5.0.2
elementType: Cl Cl O O O N C C C C C C C C C C C C C C C C C C C C C C H H H H H H H H H H H H H H H H H H H
charge: 0
multiplicity: 1
keywords: wb97x-d3
keywords: def2-TZVPP
keywords: def2/J RIJCOSX
keywords: DEFGRID2
keywords: scfconv7
keywords: smallprint printgap noloewdin
keywords: NOSOSCF
formula: C22H19Cl2NO3
InChI: InChI=1/C22H19Cl2NO3/c1-22(2)17(12-19(23)24)20(22)21(26)28-18(13-25)14-7-6-10-16(11-14)27-15-8-4-3-5-9-15/h3-12,17-18,20H,1-2H3
47 atoms
Cl -4.437832 -0.735261 -1.654096
Cl -4.190246 -2.344841 -4.033572
O  1.527105 -1.81694 0.250386
O  -0.258053 -0.742837 1.068364
O  1.749291 3.929129 0.173418
N  4.644253 -2.181487 1.23615
C  -1.512484 -3.586063 0.275027
C  -2.033671 -2.46335 -0.576014
C  -0.54033 -2.628752 -0.387489
C  -1.763127 -3.507311 1.7603
C  -1.500842 -5.000074 -0.249848
C  -2.594727 -2.689262 -1.912966
C  0.204984 -1.623791 0.388488
C  -3.601837 -2.012524 -2.449373
C  2.394785 -0.894014 0.904979
C  2.58907 0.357301 0.084486
C  3.653852 -1.618989 1.077689
C  2.087858 1.560484 0.56524
C  3.21976 0.290058 -1.151187
C  2.233167 2.709819 -0.20116
C  3.353116 1.446475 -1.904954
C  2.867015 2.655769 -1.437137
C  1.326863 4.126322 1.471262
C  -0.023061 4.33296 1.700904
C  2.247919 4.170994 2.508154
C  -0.456157 4.603719 2.992565
C  1.801478 4.433615 3.795014
C  0.451706 4.652255 4.040668
H  -2.472766 -1.646388 -0.015029
H  0.011808 -3.051512 -1.219068
H  -0.952491 -3.982915 2.314832
H  -2.684458 -4.039178 2.002724
H  -1.872135 -2.487947 2.124748
H  -0.766046 -5.593642 0.29564
H  -1.247325 -5.063328 -1.306994
H  -2.476321 -5.467959 -0.108193
H  -2.149104 -3.463352 -2.525781
H  2.027529 -0.645646 1.905329
H  1.589692 1.585878 1.525857
H  3.609742 -0.647788 -1.526766
H  3.84657 1.409505 -2.866753
H  2.975823 3.557249 -2.026478
H  -0.726564 4.292019 0.879238
H  3.300338 4.007803 2.312668
H  -1.508614 4.773834 3.176224
H  2.514462 4.47277 4.607772
H  0.110523 4.862805 5.045359
elementType: Cl O N C H
totalener: -2050.67292062 hartree
nucrepener: 2720.87842525 hartree
electener: -4771.55134587 hartree
oneelecener: -8217.47629983 hartree
twoeener: 3445.92495396 hartree
cpcmener: -0.03625829 hartree
kineticenergy: 2044.46101047 hartree
xcener: -151.861322593966 hartree
chargesum: -0.0000000
charge: -0.057538 -0.061656 -0.277117 -0.469978 -0.334798 -0.102746 0.084577 0.023331 -0.080514 -0.260987 -0.266325 -0.199881 0.422632 0.039587 0.408921 -0.034758 -0.217341 -0.158653 -0.226379 0.294262 -0.124645 -0.233286 0.243176 -0.202417 -0.178266 -0.147160 -0.153841 -0.161651 0.077119 0.101826 0.102399 0.099932 0.093083 0.099339 0.093140 0.101411 0.133007 0.140507 0.137247 0.146281 0.162127 0.149317 0.150416 0.158806 0.161599 0.162870 0.163024
qa: -0.0575 -0.0617 -0.2771 -0.4700 -0.3348 -0.1027 0.0846 0.0233 -0.0805 -0.2610 -0.2663 -0.1999 0.4226 0.0396 0.4089 -0.0348 -0.2173 -0.1587 -0.2264 0.2943 -0.1246 -0.2333 0.2432 -0.2024 -0.1783 -0.1472 -0.1538 -0.1617 0.0771 0.1018 0.1024 0.0999 0.0931 0.0993 0.0931 0.1014 0.1330 0.1405 0.1372 0.1463 0.1621 0.1493 0.1504 0.1588 0.1616 0.1629 0.1630
va: 1.2681 1.2434 2.1371 2.0398 2.0739 3.1080 3.7620 3.8712 3.8175 3.9091 3.9073 3.9000 4.1783 4.2093 3.7229 3.6788 4.0708 3.8935 3.9885 3.7231 3.9150 4.0080 3.7042 3.9930 3.9445 3.8861 3.8865 3.8808 1.0504 1.0313 0.9995 1.0005 1.0159 1.0009 1.0056 1.0010 1.0183 1.0176 1.0221 1.0079 0.9884 1.0062 1.0036 0.9964 0.9888 0.9889 0.9885
dispcorr: -0.023018973 hartree
energy: -2050.695939593285
dipole: 15.18535 -15.74499 -0.55964 -2.06523 1.58877 -0.47646 21.72389 -21.41891 0.30499
magnitude: 0.79575 au
magnitude: 2.02264 debye
