program: Gaussian 09
title: 000074417
version: EM64L-G09RevD.01
frameworkgroup: C1[X(C16H16)]
method: RPBEPBE
basis: SDD
operation: Freq
keyword: #p
keyword: freq=noraman
keyword: PBEPBE/SDD
title: #p freq=noraman PBEPBE/SDD
converged: NO YES NO NO
title: Mulliken charges:
elementType: C C C C C C C C C C C C C C C C H H H H H H H H H H H H H H H H
charge: -0.076380 -0.076382 0.410594 0.410604 0.410612 0.410591 -0.563183 -0.563191 -0.563196 -0.563179 -0.425048 -0.425048 -0.480227 -0.480244 -0.480251 -0.480224 0.217421 0.223837 0.223835 0.217421 0.217418 0.223838 0.223835 0.217423 0.204290 0.218932 0.218934 0.204289 0.230668 0.230670 0.230671 0.230668
chargesum: 0.00000
title: Mulliken charges with hydrogens summed into heavy atoms:
elementType: C C C C C C C C C C C C C C C C
charge: -0.076380 -0.076382 0.410594 0.410604 0.410612 0.410591 -0.121925 -0.121935 -0.121940 -0.121921 -0.001826 -0.001825 -0.249558 -0.249574 -0.249580 -0.249556
polarizability: 2.14592968e+02 5.98769188e-04 2.00840474e+02 -1.42245305e-03 6.35747764e-04 9.15228877e+01
1716.lowfreq: -12.3307 -0.0007 -0.0005 -0.0005 3.9450 6.8650 86.7521 97.8895 128.4633
frequency: 86.7324 97.8895 128.4582 183.2596 211.6489 285.4500 320.6627 326.3606 347.2797 389.8165 423.2349 455.1102 456.7634 460.1121 468.0775 521.1451 532.2992 555.8536 568.5461 638.0707 679.2707 701.7927 722.8507 807.1371 812.4578 815.0414 840.2101 854.6337 873.9492 876.4506 899.0585 908.2722 920.8881 948.1731 950.5991 982.5088 1052.4261 1054.0142 1062.8813 1065.2204 1119.9179 1131.9575 1138.9055 1146.0077 1157.1448 1180.9411 1181.3908 1194.4086 1232.1859 1237.2926 1248.5200 1251.1834 1267.4688 1306.7815 1320.0686 1325.3611 1344.6276 1344.8374 1349.3828 1370.7553 1386.5098 1407.8162 1421.7269 1447.5260 1451.1937 1461.2080 1462.4831 1470.8432 1470.9256 1472.0134 1530.6785 1597.8967 1607.3401 1610.7294 2948.5341 2948.7681 2949.4795 2949.6725 2985.7674 2985.9854 3022.0947 3022.2922 3027.1969 3027.7315 3049.5817 3049.8412 3105.4926 3105.5590 3128.8349 3129.4274
redmass: 2.5370 3.5429 2.4091 3.7707 2.6262 1.9958 3.8759 3.0735 1.9865 3.5892 5.4774 3.2713 3.7941 4.1134 3.6275 2.1873 4.2498 2.7212 5.4362 3.2255 4.1226 4.6850 2.9916 1.3006 5.9602 4.1353 1.2911 1.4384 1.9872 1.5325 2.5615 2.7699 3.2441 1.3676 1.3959 2.3698 1.9945 2.2851 1.9027 1.9236 1.5604 1.8758 1.2046 1.6477 1.4403 1.4661 3.2947 1.4103 1.5694 1.3551 2.0872 1.2713 1.2981 1.7381 1.5295 1.4060 1.7709 1.5876 1.4242 3.0148 3.5398 3.3270 4.2595 1.2512 1.1115 1.1063 1.1066 1.0905 1.0983 2.3483 5.1252 5.9371 8.1880 7.6087 1.0662 1.0663 1.0661 1.0661 1.0615 1.0616 1.0942 1.0943 1.0921 1.0919 1.1042 1.1042 1.0868 1.0871 1.0961 1.0957
irintensity: 0.0000 1.9324 0.6455 5.3267 0.3727 4.0339 1.4499 0.0000 0.4295 0.1745 0.0000 1.7521 0.6485 0.0000 0.2131 1.2923 0.3743 0.0001 0.0750 0.0000 5.2623 0.0000 3.9975 1.5612 0.0471 1.1603 62.8494 0.0000 14.5502 0.6517 1.6635 0.0758 18.1418 0.0017 0.0000 7.8511 0.0000 0.0500 2.6501 1.8117 0.1889 0.0000 4.7505 0.0000 5.3174 1.3171 1.4330 0.0000 0.0000 2.1285 5.3054 0.3733 17.4346 1.8727 5.6901 0.0000 1.3075 2.4153 0.0000 0.4521 2.5386 30.5617 0.8024 0.0000 15.7414 13.4847 3.6100 7.7873 12.5076 0.0000 1.7555 22.0976 0.0048 0.0000 32.5205 0.0298 50.6248 45.6640 44.6499 24.6099 0.1668 70.1268 77.9864 41.4423 64.5979 46.1641 35.1080 0.0261 69.7215 0.0007
temp: 298.150 k
press: 1.00000 atm
elementType: 6 6 6 6 6 6 6 6 6 6 6 6 6 6 6 6 1 1 1 1 1 1 1 1 1 1 1 1 1 1 1 1
symmnumber: 1
zpe: 713984.5 jmol-1
zpe.correction: 0.271942 hartree
zpe.thermalcorrener: 0.283803 hartree
zpe.thermalcorrenthalpy: 0.284748 hartree
zpe.thermalcorrgfe: 0.234673 hartree
zpe.sumelectzpe: -618.214185 hartree
zpe.sumelectthermal: -618.202324 hartree
zpe.sumelectthermalent: -618.201380 hartree
zpe.sumelectthermalfe: -618.251454 hartree
dipole: 0.0000 0.0000 -0.0921
dipole: 0.0921
quadrupole: -82.5460 -88.1155 -98.0856
quadrupole: 0.0002 -0.0002 0.0001
quadrupole: 7.0364 1.4669 -8.5032 0.0002 -0.0002 0.0001
hfenergy: -618.4861271 hartree
pointgroup: C01 [X(C16H16)]
dipole: -0.0000033 0.0000029 0.0362281 debye
polarizability: 214.5929676|-0.0007737|200.8404737|-0.0014225|-0.0006357|91.5228877 unknown
InChI: InChI=1S/C16H16/c1-3-11-7-9-13-5-2-6-14-10-8-12(4-1)15(11)16(13)14/h7-10H,1-6H2
charge 0 multiplicity 1
32 atoms
C  -0.726403 0.000004 0.080658
C  0.726423 -0.000015 0.080635
C  -1.439668 1.255242 0.082244
C  1.43972 1.255211 0.082268
C  -1.439702 -1.255222 0.082321
C  1.43969 -1.255256 0.082222
C  -2.96353 1.262039 0.102776
C  2.963585 1.261938 0.102867
C  -2.963562 -1.26195 0.102947
C  2.963555 -1.262052 0.102737
C  -3.553596 0.000007 -0.563169
C  3.553611 -0.000031 -0.563232
C  -0.712973 2.449827 0.067725
C  0.713057 2.44981 0.067751
C  -0.713037 -2.449823 0.067794
C  0.712993 -2.449836 0.067736
H  -3.318617 1.304551 1.155117
H  -3.340148 2.179053 -0.388914
H  3.340266 2.179008 -0.388669
H  3.318605 1.304268 1.155236
H  -3.318571 -1.304233 1.155325
H  -3.340258 -2.179031 -0.388547
H  3.34016 -2.179073 -0.388952
H  3.318644 -1.304557 1.155077
H  -4.656458 0.000027 -0.472249
H  -3.306824 -0.000068 -1.642873
H  3.306827 0.000028 -1.642929
H  4.656474 -0.000045 -0.472316
H  -1.250667 3.40632 0.051001
H  1.250771 3.406292 0.051064
H  -1.250755 -3.406302 0.051139
H  1.250684 -3.406331 0.051011
