program: Orca
programVersion: 5.0.2
elementType: Cl Cl O O O N C C C C C C C C C C C C C C C C C C C C C C H H H H H H H H H H H H H H H H H H H
charge: 0
multiplicity: 1
keywords: wb97x-d3
keywords: def2-TZVPP
keywords: def2/J RIJCOSX
keywords: DEFGRID2
keywords: scfconv7
keywords: smallprint printgap noloewdin
keywords: NOSOSCF
formula: C22H19Cl2NO3
InChI: InChI=1/C22H19Cl2NO3/c1-22(2)17(12-19(23)24)20(22)21(26)28-18(13-25)14-7-6-10-16(11-14)27-15-8-4-3-5-9-15/h3-12,17-18,20H,1-2H3
47 atoms
Cl -1.259462 -0.81742 -2.433054
Cl -3.21336 -2.189727 -4.060212
O  1.369933 -1.95525 0.303273
O  -0.287757 -1.125941 1.553109
O  0.373512 3.683212 0.324874
N  4.661643 -1.641273 0.302088
C  -1.786916 -3.772299 0.710731
C  -2.194205 -2.623482 -0.140373
C  -0.718637 -2.925241 0.034015
C  -2.00245 -3.69331 2.200841
C  -1.925961 -5.169222 0.156736
C  -2.808201 -2.785774 -1.475933
C  0.09453 -1.921716 0.731148
C  -2.473941 -2.033716 -2.515167
C  2.198906 -0.864316 0.698812
C  1.87178 0.367588 -0.110516
C  3.570788 -1.31349 0.462219
C  1.339196 1.476347 0.530692
C  2.023266 0.348499 -1.492494
C  0.962298 2.580177 -0.224408
C  1.637529 1.455688 -2.231146
C  1.10898 2.573892 -1.604533
C  0.660315 4.055715 1.617088
C  1.968626 4.180676 2.0667
C  -0.410106 4.371077 2.439425
C  2.196295 4.624252 3.361314
C  -0.166788 4.826813 3.727971
C  1.134149 4.95003 4.19522
H  -2.534137 -1.744235 0.401534
H  -0.223036 -3.402063 -0.803303
H  -2.015237 -2.674515 2.580979
H  -1.227646 -4.246806 2.733527
H  -2.962423 -4.147144 2.452215
H  -1.725596 -5.218626 -0.913898
H  -2.936388 -5.545016 0.326106
H  -1.231774 -5.847622 0.654492
H  -3.587142 -3.527769 -1.609357
H  2.109517 -0.659311 1.769867
H  1.210471 1.465872 1.605686
H  2.435602 -0.518135 -1.994282
H  1.752818 1.453595 -3.306527
H  0.806284 3.437428 -2.182838
H  2.802233 3.9424 1.418023
H  -1.423088 4.268281 2.071708
H  3.214006 4.724274 3.71498
H  -1.00141 5.079112 4.36862
H  1.320546 5.301002 5.201309
elementType: Cl O N C H
totalener: -2050.67027484 hartree
nucrepener: 2832.27892954 hartree
electener: -4882.94920438 hartree
oneelecener: -8440.66586784 hartree
twoeener: 3557.71666345 hartree
cpcmener: -0.03458753 hartree
kineticenergy: 2044.46851889 hartree
xcener: -151.863534688877 hartree
chargesum: -0.0000000
charge: -0.055971 -0.057757 -0.276371 -0.468776 -0.336786 -0.101994 0.136134 -0.030243 -0.121998 -0.270039 -0.278479 -0.230062 0.387457 0.092951 0.427778 0.030975 -0.219238 -0.168677 -0.279396 0.281484 -0.126632 -0.224936 0.279967 -0.192353 -0.245467 -0.144152 -0.127038 -0.184405 0.115095 0.116168 0.092631 0.101737 0.097225 0.093880 0.103385 0.100782 0.142878 0.137672 0.144102 0.146052 0.163654 0.151273 0.160845 0.149530 0.163217 0.161935 0.161965
qa: -0.0560 -0.0578 -0.2764 -0.4688 -0.3368 -0.1020 0.1361 -0.0302 -0.1220 -0.2700 -0.2785 -0.2301 0.3875 0.0930 0.4278 0.0310 -0.2192 -0.1687 -0.2794 0.2815 -0.1266 -0.2249 0.2800 -0.1924 -0.2455 -0.1442 -0.1270 -0.1844 0.1151 0.1162 0.0926 0.1017 0.0972 0.0939 0.1034 0.1008 0.1429 0.1377 0.1441 0.1461 0.1637 0.1513 0.1608 0.1495 0.1632 0.1619 0.1620
va: 1.2947 1.2489 2.1291 2.0330 2.0703 3.1098 3.7198 3.8670 3.8292 3.8904 3.9149 3.9232 4.1682 4.1772 3.7147 3.5629 4.0717 3.9244 3.9512 3.7272 3.8536 4.0076 3.6779 3.9221 4.0114 3.8811 3.8784 3.8973 1.0236 1.0238 1.0174 0.9989 1.0009 0.9992 0.9995 1.0024 1.0081 1.0181 1.0157 1.0122 0.9876 1.0036 0.9954 1.0066 0.9888 0.9880 0.9891
dispcorr: -0.025940306 hartree
energy: -2050.696215149408
dipole: 1.15038 -2.73084 -1.58046 -2.48717 1.88094 -0.60623 26.62906 -25.98418 0.64488
magnitude: 1.81142 au
magnitude: 4.60425 debye
