program: Gaussian 09
title: 000074412
version: EM64L-G09RevD.01
frameworkgroup: C1[X(C10H15N)]
method: RPBEPBE
basis: SDD
operation: Freq
keyword: #pfreq=noraman
keyword: PBEPBE/SDD
title: #p freq=noraman PBEPBE/SDD
converged: YES YES NO NO
title: Mulliken charges:
elementType: N C C C C C C C C C C H H H H H H H H H H H H H H H
charge: -0.022314 0.250019 -0.503656 0.210808 -0.544371 0.262134 -0.740463 -0.763717 -0.835264 -0.585412 -0.134949 0.224661 0.213878 0.243191 0.217786 0.228013 0.208014 0.216561 0.217677 0.213337 0.223875 0.232489 0.245670 0.216972 0.251301 0.253759
chargesum: 0.00000
title: Mulliken charges with hydrogens summed into heavy atoms:
elementType: N C C C C C C C C C C
charge: -0.022314 0.250019 -0.065117 0.210808 -0.083394 0.262134 -0.087875 -0.108828 -0.140133 -0.080352 -0.134949
polarizability: 1.32820049e+02 9.75924853e+00 1.01925310e+02 -1.55490556e+00 -6.69577232e-01 8.94318598e+01
1716.lowfreq: -20.6265 -0.0008 -0.0003 0.0006 3.0721 6.2744 35.1294 71.1908 95.9646
frequency: 35.0016 71.1166 95.9419 142.6710 168.3364 205.0521 225.8993 247.8207 273.0187 280.9914 318.9706 332.9482 357.7308 383.6862 417.1402 494.0129 554.6045 585.9944 622.6300 668.9957 772.7542 842.5008 876.7702 905.4972 922.4936 926.3661 944.3398 971.9192 1005.3993 1015.9652 1036.7203 1068.4820 1103.2574 1117.3787 1162.1175 1196.6694 1209.8583 1229.6895 1247.6818 1273.0245 1288.3709 1300.5008 1327.4744 1372.8366 1391.4903 1400.5901 1436.4821 1456.3402 1460.6729 1464.9532 1466.8047 1476.3457 1477.8218 1482.5081 1486.8895 1691.1150 2194.0098 2955.3822 2966.7779 2967.6599 2968.2076 2971.9891 2998.2501 3024.0631 3038.7597 3043.9526 3059.1279 3064.7343 3066.7305 3070.0190 3072.8869 3074.9685
redmass: 4.4207 3.9198 2.8970 1.0695 2.8024 1.5414 1.3362 1.2555 1.9050 2.4533 2.2978 2.6670 3.1462 3.3127 2.9411 3.1884 3.3574 3.2488 3.5177 3.6646 1.9277 2.3025 1.9911 1.9900 1.7245 2.5489 1.6705 1.4775 1.7634 1.7069 1.5894 2.2288 1.4294 2.0790 1.6627 1.6246 2.0465 1.6646 1.8962 2.4428 1.4330 1.7633 2.0768 1.1981 1.2410 1.2319 1.0801 1.0566 1.0561 1.0599 1.0681 1.0742 1.0680 1.0587 1.0613 7.9720 12.4321 1.0658 1.0377 1.0547 1.0433 1.0358 1.0641 1.0918 1.0962 1.0933 1.1014 1.1015 1.0986 1.1008 1.0992 1.0975
irintensity: 4.0519 2.6071 1.3051 0.7729 1.0145 1.7172 0.3568 0.4628 1.3507 0.3228 0.6567 3.4035 0.2633 1.6379 0.8358 1.0579 0.7293 0.9077 3.5050 1.1278 3.5823 1.6820 1.8488 1.0317 1.1089 4.1494 1.3392 0.6197 2.3737 0.6493 2.1728 8.6762 5.1085 17.3680 4.2983 0.8037 1.1332 6.6258 6.8608 0.9438 0.5027 2.9548 10.0168 20.1788 7.3899 15.4368 15.6344 8.9618 5.8003 8.9716 6.1527 14.8506 10.4671 9.7902 6.6387 0.8170 12.5210 39.0445 25.5518 14.3270 39.2723 36.2769 30.1944 25.6794 17.8580 6.9626 7.1309 2.4125 81.0241 42.9792 30.5421 55.0151
temp: 298.150 k
press: 1.00000 atm
elementType: 7 6 6 6 6 6 6 6 6 6 6 1 1 1 1 1 1 1 1 1 1 1 1 1 1 1
symmnumber: 1
zpe: 585154.3 jmol-1
zpe.correction: 0.222874 hartree
zpe.thermalcorrener: 0.235276 hartree
zpe.thermalcorrenthalpy: 0.236221 hartree
zpe.thermalcorrgfe: 0.184560 hartree
zpe.sumelectzpe: -443.942974 hartree
zpe.sumelectthermal: -443.930572 hartree
zpe.sumelectthermalent: -443.929627 hartree
zpe.sumelectthermalfe: -443.981288 hartree
dipole: 3.6572 1.2093 -2.2378
dipole: 4.4548
quadrupole: -84.5004 -64.4053 -68.5255
quadrupole: -3.6226 8.9661 0.4489
quadrupole: -12.0233 8.0718 3.9515 -3.6226 8.9661 0.4489
hfenergy: -444.1658479 hartree
pointgroup: C01 [X(C10H15N1)]
dipole: -1.4388837 -0.4548471 -0.8913711 debye
dipolederiv: -0.3476121 -0.0098206 0.0023941 -0.0534747 -0.2459914 0.003081 -0.1241502 -0.0143204 -0.2190671 0.127384 0.0286982 0.0091873 -0.0513474 0.0153675 -0.0304742 -0.0252033 -0.0548082 0.1837497 0.001592 -0.0799791 0.0507543 -0.0889176 0.0163086 -0.0167781 -0.0027973 0.0110718 0.0754291 0.0969556 0.0088134 -0.069877 0.1362175 0.1729673 0.0310042 -0.0268589 0.0683433 -0.1565504 -0.0454313 0.0046872 0.0991844 -0.0033085 -0.0157755 -0.0395702 0.1385133 -0.0099937 0.1479383 0.1354556 -0.0398023 -0.0826842 -0.0476354 0.0743701 0.0012644 -0.1840949 -0.03621 -0.1864859 -0.0495545 -0.0013371 -0.049843 0.0437798 0.0649127 0.0151149 0.0193506 0.0248876 -0.048301 -0.0175781 -0.0275828 0.0393694 0.0272628 0.0568252 0.0431478 0.0314857 0.050191 -0.0238648 0.0026621 -0.0096732 0.0288455 -0.0033124 -0.1349942 -0.0332094 0.0299695 -0.0249601 0.0817798 0.1067206 0.0325315 -0.0500418 -0.0463864 0.1277919 -0.0667663 0.0076525 -0.0705868 0.1723717 0.0642426 0.0338952 0.1285584 0.113487 -0.0208669 0.0350152 0.215056 0.0442155 0.0143915 0.037096 -0.0167906 -0.0527969 -0.0108644 0.0701 0.0192537 -0.0127157 -0.0313945 -0.16376 -0.0750639 0.1383779 0.0056257 0.1235022 -0.0675262 0.0099185 -0.0151665 0.0410545 0.0703778 -0.0409057 -0.1021512 -0.0597554 -0.0905203 -0.0064951 -0.0353419 -0.0861201 -0.0875885 0.0332099 0.0649402 0.0529663 -0.0090469 -0.0127721 -0.0505686 0.0785976 0.0088501 0.1331681 -0.113063 0.0575404 -0.0585396 0.0912891 -0.0353755 0.0197639 0.109295 0.051002 0.0897871 -0.0726852 0.0777573 -0.0448885 -0.0316935 -0.0989364 -0.1341033 -0.1004589 -0.0356489 -0.0586642 0.0429451 -0.1522981 0.0796489 0.0273823 0.1270893 0.0324369 -0.0272841 0.0529627 -0.0521308 0.0576277 -0.0968553 0.0759929 0.0910717 0.1269235 0.0058633 -0.0602484 0.0817932 -0.0116599 0.0491082 0.0612413 -0.0804238 -0.0107959 -0.1143826 -0.1331261 -0.0250921 -0.03041 -0.0766162 0.0496324 -0.0035201 0.0270878 -0.140284 0.0001379 0.0734196 0.0292931 -0.0995419 0.0384856 -0.0694388 -0.0298792 -0.0818557 -0.1219069 -0.0622089 0.0338847 -0.0124842 -0.1181577 -0.0742488 0.0151513 0.0960342 -0.035422 0.0360173 -0.0605005 -0.0072718 0.0599112 0.0360311 0.1199014 -0.0628794 -0.1129095 0.1268326 0.0915639 0.0620245 0.0473343 -0.0177846 0.0836672 -0.0532376 0.0594179 0.0562747 0.022956 -0.0271217 0.0783709 -0.0569858 -0.0684547 -0.0340951 -0.0241849 0.0879326 -0.0142888 -0.0442214 0.0046037 -0.0588522 0.0623589 0.0990506 0.0386268 0.0594988 -0.0249675 unknown
polarizability: 130.2731713|13.0002836|103.8470039|1.1877871|2.9835255|90.0570432 unknown
InChI: InChI=1S/C10H15N/c1-8-9(5-7-11)4-6-10(8,2)3/h4-6H2,1-3H3
charge 0 multiplicity 1
26 atoms
N  3.855071 0.662009 0.71774
C  -1.753287 0.040631 0.23957
C  -1.216127 1.457321 0.643882
C  -0.463446 -0.675427 -0.224163
C  0.107647 1.653455 -0.146694
C  0.540667 0.222486 -0.443736
C  -2.751169 0.143482 -0.952421
C  -2.442672 -0.668133 1.431138
C  -0.439513 -2.168507 -0.437244
C  1.930586 -0.069558 -0.987149
C  3.002738 0.332181 -0.049794
H  -0.994459 1.462081 1.7276
H  -1.957254 2.253039 0.448908
H  0.865099 2.215173 0.432033
H  -0.050002 2.216866 -1.090971
H  -2.30812 0.706259 -1.794598
H  -3.040233 -0.857302 -1.32531
H  -3.675767 0.663344 -0.637814
H  -3.28933 -0.058754 1.799537
H  -2.845344 -1.657033 1.141848
H  -1.73786 -0.814425 2.270428
H  -1.229351 -2.484007 -1.146887
H  -0.632746 -2.707446 0.509991
H  0.526223 -2.530126 -0.83086
H  2.056195 -1.143391 -1.217086
H  2.095652 0.481184 -1.93665
