program: Gaussian 09
title: 000074409
version: EM64L-G09RevD.01
frameworkgroup: C1[X(C11H20O2)]
method: RPBEPBE
basis: SDD
operation: Freq
keyword: #pfreq=noraman
keyword: PBEPBE/SDD
title: #p freq=noraman PBEPBE/SDD
converged: YES YES NO NO
title: Mulliken charges:
elementType: O O C C C C C C C C C C C H H H H H H H H H H H H H H H H H H H H
charge: -0.266166 -0.248643 -0.383383 -0.394839 -0.391281 -0.375850 -0.378389 -0.379441 -0.399437 -0.400028 -0.512176 -0.306717 0.270972 0.190492 0.190394 0.197764 0.191604 0.204831 0.196490 0.229851 0.193639 0.200159 0.211131 0.189645 0.191373 0.203883 0.224365 0.204037 0.233654 0.234879 0.230112 0.213320 0.233755
chargesum: 0.00000
title: Mulliken charges with hydrogens summed into heavy atoms:
elementType: O O C C C C C C C C C C C
charge: -0.266166 -0.248643 -0.002497 -0.005471 0.010039 0.047640 0.032901 0.001578 0.028811 0.037663 -0.047184 0.140358 0.270972
polarizability: 1.37287952e+02 -2.81770526e+00 1.22052698e+02 -1.22621946e+00 -2.42568261e+00 1.01874416e+02
1716.lowfreq: -10.7528 -0.0009 -0.0009 -0.0003 6.4808 14.8549 42.9065 59.3055 89.3224
frequency: 42.3381 59.1204 89.2600 136.1641 163.3316 189.3125 214.4881 232.9330 243.9824 272.6837 287.2347 308.8582 327.7949 377.0706 410.3220 446.3222 469.1080 504.9552 582.9645 668.3405 701.6816 741.9843 760.6468 770.1547 803.3333 813.7199 831.0198 856.4326 895.3727 913.3907 940.0154 957.1686 974.5534 1006.1694 1033.2257 1037.7635 1075.2237 1089.2213 1093.8518 1108.0758 1122.1615 1124.4706 1147.5850 1163.7458 1193.2593 1206.4694 1220.8211 1249.9596 1269.9075 1282.4265 1284.2538 1298.2343 1300.4874 1321.8827 1335.8442 1342.2343 1346.7186 1350.0564 1353.5055 1357.4125 1365.6966 1369.5529 1445.7048 1455.5863 1456.5114 1462.8491 1464.0885 1465.3882 1467.2159 1478.8511 1481.0229 1490.0567 1640.0391 2956.7851 2956.9192 2969.2647 2975.0744 2975.5098 2980.2298 2983.7480 2984.9636 3006.9100 3010.0871 3013.4605 3017.0225 3019.9426 3026.9796 3041.6349 3044.7438 3049.4137 3062.3378 3092.2838 3095.4756
redmass: 5.5392 3.1251 3.4790 3.7141 3.6858 2.4129 2.5989 1.9047 3.0332 2.1751 2.4414 2.6864 2.0302 2.3999 2.1478 2.6492 2.1831 2.3318 4.0175 2.6715 1.3153 1.3516 3.4984 2.0649 1.8884 1.8958 2.0767 2.8244 2.0186 1.8044 2.7392 2.1161 1.7361 1.7596 1.9638 1.9466 2.3539 1.8419 1.9412 2.3847 1.9874 2.4387 1.5312 1.4170 1.3318 1.4018 1.3085 1.2659 1.1756 1.2479 1.2406 1.2363 1.1902 1.2243 1.2766 1.3936 1.3836 1.3749 1.4677 1.4702 1.4390 1.3006 1.1002 1.0810 1.0831 1.1000 1.0862 1.0878 1.0718 1.0822 1.0846 1.0952 9.0695 1.0603 1.0606 1.0613 1.0615 1.0668 1.0632 1.0654 1.0624 1.0982 1.0987 1.0694 1.0885 1.0635 1.0958 1.1007 1.0950 1.1025 1.0960 1.0984 1.1075
irintensity: 1.5746 1.1460 0.3114 0.3689 0.8115 2.2522 1.1079 0.6181 3.6188 4.1149 1.3509 1.6422 3.7820 3.5493 3.2280 0.8397 2.3919 1.1685 5.7795 2.9100 9.0714 22.2742 8.4097 2.3795 4.4474 5.9500 1.3157 3.3728 3.9724 2.4509 40.1897 1.3741 3.4544 7.2741 0.9403 45.8961 8.0354 62.1539 11.1871 14.7819 50.0932 37.6767 1.2819 14.7783 3.1712 68.9142 6.6917 4.1268 7.1386 3.2826 0.7461 1.3694 0.2990 8.6948 6.1278 13.6300 3.5117 0.4513 1.2975 0.5732 0.4289 2.3735 16.8977 18.1503 7.6086 15.9028 13.5539 12.7601 1.3036 2.2127 0.1250 39.8883 150.6824 27.4000 35.2533 20.1820 40.6357 58.6607 27.0240 42.3815 18.9853 43.0289 14.2547 10.7634 41.5397 26.3894 65.4677 76.8258 61.6024 59.1838 53.8711 19.9646 20.7498
temp: 298.150 k
press: 1.00000 atm
elementType: 8 8 6 6 6 6 6 6 6 6 6 6 6 1 1 1 1 1 1 1 1 1 1 1 1 1 1 1 1 1 1 1 1
symmnumber: 1
zpe: 771629.5 jmol-1
zpe.correction: 0.293898 hartree
zpe.thermalcorrener: 0.307375 hartree
zpe.thermalcorrenthalpy: 0.308319 hartree
zpe.thermalcorrgfe: 0.254172 hartree
zpe.sumelectzpe: -580.562689 hartree
zpe.sumelectthermal: -580.549212 hartree
zpe.sumelectthermalent: -580.548267 hartree
zpe.sumelectthermalfe: -580.602415 hartree
dipole: 0.8186 1.0424 -1.1795
dipole: 1.7742
quadrupole: -74.7130 -82.9079 -83.8876
quadrupole: -4.7965 3.0165 4.1309
quadrupole: 5.7898 -2.4051 -3.3847 -4.7965 3.0165 4.1309
hfenergy: -580.8565867 hartree
pointgroup: C01 [X(C11H20O2)]
dipole: -0.4376674 -0.2882973 -0.4610596 debye
polarizability: 134.0745202|-6.8202243|125.2961679|1.8092544|1.8616976|101.8443786 unknown
InChI: InChI=1S/C11H20O2/c12-11-9-7-5-3-1-2-4-6-8-10-13-11/h1-10H2
charge 0 multiplicity 1
33 atoms
O  0.330228 1.435839 -0.846904
O  1.718764 1.755556 1.004502
C  -1.051559 -2.677244 0.045943
C  -1.891615 -1.466611 0.533905
C  0.370562 -2.309474 -0.455991
C  -2.250378 -0.4502 -0.579706
C  1.300724 -1.760673 0.653252
C  -2.757972 0.9111 -0.035948
C  2.600945 -1.093929 0.140916
C  -1.684871 1.799622 0.645413
C  2.365748 0.151531 -0.763657
C  -0.641932 2.433533 -0.291708
C  1.482735 1.187916 -0.087472
H  -1.59994 -3.188186 -0.772459
H  -0.964916 -3.413661 0.87167
H  -2.829613 -1.840658 0.993174
H  -1.345989 -0.95147 1.348778
H  0.277363 -1.566889 -1.270621
H  0.839538 -3.206174 -0.910106
H  -1.373947 -0.265629 -1.225673
H  -3.03345 -0.89461 -1.227595
H  1.571058 -2.587565 1.340843
H  0.755692 -1.020718 1.271052
H  -3.214928 1.488301 -0.866638
H  -3.571785 0.724512 0.695123
H  3.201982 -1.823331 -0.437547
H  3.211754 -0.784008 1.009881
H  -2.197873 2.645499 1.148766
H  -1.157326 1.248805 1.446601
H  1.917771 -0.129579 -1.729883
H  3.343522 0.627176 -0.970219
H  -1.112468 2.863038 -1.192446
H  -0.062125 3.206079 0.244753
