program: Orca
programVersion: 5.0.2
elementType: Cl Cl O O O N C C C C C C C C C C C C C C C C C C C C C C H H H H H H H H H H H H H H H H H H H
charge: 0
multiplicity: 1
keywords: wb97x-d3
keywords: def2-TZVPP
keywords: def2/J RIJCOSX
keywords: DEFGRID2
keywords: scfconv7
keywords: smallprint printgap noloewdin
keywords: NOSOSCF
formula: C22H19Cl2NO3
InChI: InChI=1/C22H19Cl2NO3/c1-22(2)17(12-19(23)24)20(22)21(26)28-18(13-25)14-7-6-10-16(11-14)27-15-8-4-3-5-9-15/h3-12,17-18,20H,1-2H3
47 atoms
Cl -3.225075 -2.82869 3.10715
Cl -5.192544 -1.017875 2.025903
O  1.367453 -1.079996 -1.232942
O  1.220959 -2.205442 0.69431
O  2.33005 3.900382 -0.016916
N  3.812333 -0.548682 -3.389825
C  -1.451788 -3.037747 -0.948986
C  -1.71985 -2.383152 0.380176
C  -0.75374 -1.742525 -0.587349
C  -0.687605 -4.337685 -0.941078
C  -2.474312 -2.952174 -2.054434
C  -2.991851 -1.707713 0.663687
C  0.685542 -1.721655 -0.270353
C  -3.697368 -1.838265 1.779914
C  2.763227 -0.89146 -1.020752
C  3.024935 0.30328 -0.138032
C  3.333169 -0.696466 -2.355004
C  2.535793 1.547734 -0.520975
C  3.723301 0.148667 1.049156
C  2.747945 2.640089 0.305668
C  3.944123 1.257204 1.856132
C  3.454829 2.500575 1.494975
C  1.188102 4.076012 -0.763944
C  -0.00294 3.442316 -0.431855
C  1.251854 4.962527 -1.8274
C  -1.137603 3.702227 -1.186264
C  0.105085 5.223074 -2.565561
C  -1.09033 4.591698 -2.252412
H  -1.256977 -2.883292 1.223326
H  -1.104588 -0.871584 -1.130513
H  -0.107497 -4.44979 -1.859106
H  -1.388424 -5.172692 -0.889343
H  -0.008085 -4.430013 -0.09494
H  -3.24139 -3.717639 -1.924995
H  -1.995196 -3.122511 -3.019934
H  -2.969799 -1.983938 -2.10355
H  -3.397776 -1.050424 -0.096133
H  3.229828 -1.787148 -0.599037
H  2.000672 1.660343 -1.45707
H  4.094776 -0.824731 1.341284
H  4.490588 1.149466 2.78327
H  3.619385 3.362726 2.128595
H  -0.052202 2.757638 0.405739
H  2.187824 5.448211 -2.072277
H  -2.066811 3.210156 -0.930569
H  0.152897 5.918095 -3.393541
H  -1.980618 4.792702 -2.83299
elementType: Cl O N C H
totalener: -2050.67270241 hartree
nucrepener: 2755.22103301 hartree
electener: -4805.89373542 hartree
oneelecener: -8285.56264545 hartree
twoeener: 3479.66891003 hartree
cpcmener: -0.03720029 hartree
kineticenergy: 2044.45192922 hartree
xcener: -151.859713586759 hartree
chargesum: 0.0000000
charge: -0.057706 -0.061340 -0.281126 -0.460558 -0.338492 -0.100708 0.086617 0.026144 -0.088608 -0.257364 -0.262443 -0.202328 0.407107 0.036167 0.419781 0.015113 -0.222203 -0.197010 -0.202555 0.248352 -0.114242 -0.236190 0.275864 -0.187706 -0.244970 -0.146060 -0.127869 -0.182993 0.076551 0.104994 0.102259 0.100451 0.092381 0.101813 0.099231 0.092346 0.135617 0.142387 0.149192 0.150320 0.162376 0.151204 0.159325 0.149865 0.163199 0.161709 0.162104
qa: -0.0577 -0.0613 -0.2811 -0.4606 -0.3385 -0.1007 0.0866 0.0261 -0.0886 -0.2574 -0.2624 -0.2023 0.4071 0.0362 0.4198 0.0151 -0.2222 -0.1970 -0.2026 0.2484 -0.1142 -0.2362 0.2759 -0.1877 -0.2450 -0.1461 -0.1279 -0.1830 0.0766 0.1050 0.1023 0.1005 0.0924 0.1018 0.0992 0.0923 0.1356 0.1424 0.1492 0.1503 0.1624 0.1512 0.1593 0.1499 0.1632 0.1617 0.1621
va: 1.2675 1.2435 2.1342 2.0494 2.0663 3.1094 3.7629 3.8693 3.8180 3.9079 3.9015 3.8908 4.2022 4.2056 3.7183 3.6097 4.0864 3.9396 3.9515 3.7660 3.8983 4.0065 3.6856 3.9175 4.0115 3.8799 3.8787 3.8972 1.0506 1.0295 1.0004 1.0001 1.0146 1.0010 1.0019 1.0052 1.0150 1.0175 1.0128 1.0042 0.9880 1.0042 0.9960 1.0062 0.9890 0.9881 0.9891
dispcorr: -0.023634198 hartree
energy: -2050.696336610500
dipole: 12.05959 -13.02668 -0.96709 2.53327 -2.68794 -0.15467 -20.06047 19.91533 -0.14514
magnitude: 0.99008 au
magnitude: 2.51658 debye
