program: Orca
programVersion: 5.0.2
elementType: Cl Cl O O O N C C C C C C C C C C C C C C C C C C C C C C H H H H H H H H H H H H H H H H H H H
charge: 0
multiplicity: 1
keywords: wb97x-d3
keywords: def2-TZVPP
keywords: def2/J RIJCOSX
keywords: DEFGRID2
keywords: scfconv7
keywords: smallprint printgap noloewdin
keywords: NOSOSCF
formula: C22H19Cl2NO3
InChI: InChI=1/C22H19Cl2NO3/c1-22(2)17(12-19(23)24)20(22)21(26)28-18(13-25)14-7-6-10-16(11-14)27-15-8-4-3-5-9-15/h3-12,17-18,20H,1-2H3
47 atoms
Cl -2.953385 -1.571985 3.199205
Cl -5.058866 -0.703357 1.429627
O  1.327032 -1.424268 -1.348063
O  1.410819 -2.384438 0.668001
O  1.327756 3.361419 0.638333
N  3.466335 -0.208644 -3.545797
C  -1.230898 -3.781442 -0.331689
C  -1.571948 -2.633119 0.570043
C  -0.625838 -2.416991 -0.600828
C  -0.394289 -4.898544 0.240319
C  -2.233404 -4.263211 -1.352805
C  -2.877588 -1.96524 0.529735
C  0.783371 -2.103669 -0.322269
C  -3.531625 -1.486691 1.580291
C  2.67779 -1.007361 -1.185934
C  2.828349 0.122203 -0.194074
C  3.101775 -0.570066 -2.516823
C  1.990592 1.227706 -0.286163
C  3.798087 0.043101 0.793363
C  2.142028 2.264678 0.622531
C  3.934217 1.088325 1.696129
C  3.114206 2.200532 1.614198
C  0.785075 3.856643 -0.523092
C  1.537907 4.020671 -1.679272
C  -0.540993 4.259975 -0.474098
C  0.943165 4.591949 -2.794941
C  -1.118352 4.841837 -1.593897
C  -0.382051 5.006012 -2.758947
H  -1.087764 -2.664544 1.539427
H  -1.039096 -1.899135 -1.458484
H  0.231665 -5.34708 -0.53256
H  -1.051442 -5.679609 0.624845
H  0.248438 -4.583122 1.05801
H  -2.969234 -4.918125 -0.883658
H  -1.726583 -4.83703 -2.129924
H  -2.768864 -3.452364 -1.844177
H  -3.35013 -1.835408 -0.436466
H  3.318953 -1.847409 -0.900761
H  1.228941 1.272174 -1.055894
H  4.439049 -0.826387 0.859823
H  4.685466 1.036899 2.472669
H  3.218759 3.015279 2.319192
H  2.575807 3.714472 -1.715914
H  -1.112686 4.12793 0.435905
H  1.527302 4.719462 -3.696864
H  -2.151062 5.162475 -1.552623
H  -0.835699 5.455907 -3.631867
elementType: Cl O N C H
totalener: -2050.67279827 hartree
nucrepener: 2765.55472178 hartree
electener: -4816.22752005 hartree
oneelecener: -8306.86912476 hartree
twoeener: 3490.64160471 hartree
cpcmener: -0.03710861 hartree
kineticenergy: 2044.45214306 hartree
xcener: -151.861197897682 hartree
chargesum: 0.0000000
charge: -0.056843 -0.061414 -0.289036 -0.464511 -0.336492 -0.101588 0.088538 0.030206 -0.072396 -0.267644 -0.267308 -0.200799 0.402397 0.039817 0.431182 0.014238 -0.220929 -0.216835 -0.208055 0.271010 -0.112398 -0.241446 0.296516 -0.202086 -0.255420 -0.141663 -0.121634 -0.189235 0.081603 0.099956 0.102091 0.098647 0.094019 0.102517 0.098980 0.094063 0.132783 0.146293 0.148254 0.149701 0.162390 0.150529 0.158525 0.148381 0.162684 0.161414 0.161002
qa: -0.0568 -0.0614 -0.2890 -0.4645 -0.3365 -0.1016 0.0885 0.0302 -0.0724 -0.2676 -0.2673 -0.2008 0.4024 0.0398 0.4312 0.0142 -0.2209 -0.2168 -0.2081 0.2710 -0.1124 -0.2414 0.2965 -0.2021 -0.2554 -0.1417 -0.1216 -0.1892 0.0816 0.1000 0.1021 0.0986 0.0940 0.1025 0.0990 0.0941 0.1328 0.1463 0.1483 0.1497 0.1624 0.1505 0.1585 0.1484 0.1627 0.1614 0.1610
va: 1.2688 1.2435 2.1282 2.0453 2.0737 3.1077 3.7419 3.8706 3.8386 3.9045 3.9087 3.8996 4.1650 4.2098 3.7043 3.6085 4.0843 3.9486 3.9661 3.7378 3.8940 4.0037 3.6671 3.9165 4.0133 3.8802 3.8754 3.9027 1.0471 1.0326 0.9992 0.9999 1.0185 1.0004 1.0012 1.0051 1.0180 1.0153 1.0153 1.0022 0.9879 1.0047 0.9971 1.0073 0.9889 0.9880 0.9894
dispcorr: -0.023333438 hartree
energy: -2050.696131710762
dipole: 14.34730 -14.81827 -0.47097 -5.78297 4.82245 -0.96052 -15.94502 15.71112 -0.23390
magnitude: 1.09504 au
magnitude: 2.78338 debye
