program: Orca
programVersion: 5.0.2
elementType: Cl Cl O O O N C C C C C C C C C C C C C C C C C C C C C C H H H H H H H H H H H H H H H H H H H
charge: 0
multiplicity: 1
keywords: wb97x-d3
keywords: def2-TZVPP
keywords: def2/J RIJCOSX
keywords: DEFGRID2
keywords: scfconv7
keywords: smallprint printgap noloewdin
keywords: NOSOSCF
formula: C22H19Cl2NO3
InChI: InChI=1/C22H19Cl2NO3/c1-22(2)17(12-19(23)24)20(22)21(26)28-18(13-25)14-7-6-10-16(11-14)27-15-8-4-3-5-9-15/h3-12,17-18,20H,1-2H3
47 atoms
Cl -3.033608 -1.917039 3.238479
Cl -5.154478 -0.964882 1.532038
O  1.258359 -1.349203 -1.351926
O  1.372557 -2.361229 0.637063
O  1.336567 3.456311 0.646078
N  3.37965 -0.097099 -3.54935
C  -1.231798 -3.793903 -0.406838
C  -1.597309 -2.69567 0.546652
C  -0.670379 -2.400817 -0.620403
C  -0.354959 -4.908011 0.107912
C  -2.231023 -4.262974 -1.436686
C  -2.92394 -2.068613 0.546703
C  0.734455 -2.066626 -0.342445
C  -3.601381 -1.703602 1.627581
C  2.608791 -0.928882 -1.194944
C  2.76398 0.183847 -0.184823
C  3.020387 -0.468655 -2.521862
C  1.961097 1.314371 -0.28376
C  3.70209 0.063406 0.828899
C  2.11705 2.334333 0.64364
C  3.841092 1.090419 1.751735
C  3.056394 2.22749 1.662484
C  0.880903 3.992445 -0.534833
C  1.713166 4.165076 -1.633831
C  -0.436949 4.422776 -0.565704
C  1.207217 4.771739 -2.774362
C  -0.925522 5.038919 -1.709398
C  -0.10952 5.211417 -2.818775
H  -1.104322 -2.755433 1.510205
H  -1.104554 -1.858148 -1.451993
H  0.281735 -5.297615 -0.688191
H  -0.984164 -5.728242 0.457098
H  0.280725 -4.610091 0.938002
H  -2.940669 -4.959202 -0.986803
H  -1.716714 -4.788026 -2.242863
H  -2.79745 -3.449586 -1.887521
H  -3.393114 -1.875991 -0.410767
H  3.254798 -1.77155 -0.927976
H  1.223792 1.393068 -1.074453
H  4.317072 -0.824274 0.89899
H  4.567903 1.005954 2.548246
H  3.163768 3.029256 2.381778
H  2.744989 3.838076 -1.605788
H  -1.071884 4.28255 0.299784
H  1.853643 4.906207 -3.631597
H  -1.952536 5.378889 -1.731322
H  -0.494472 5.688273 -3.710142
elementType: Cl O N C H
totalener: -2050.67292817 hartree
nucrepener: 2751.40822726 hartree
electener: -4802.08115543 hartree
oneelecener: -8278.58056324 hartree
twoeener: 3476.49940781 hartree
cpcmener: -0.03708548 hartree
kineticenergy: 2044.45164286 hartree
xcener: -151.860840498135 hartree
chargesum: -0.0000000
charge: -0.057188 -0.061167 -0.288708 -0.465477 -0.337923 -0.102034 0.087872 0.032445 -0.075170 -0.268409 -0.265167 -0.202264 0.405736 0.039840 0.432845 0.016078 -0.221534 -0.211136 -0.205433 0.258760 -0.115004 -0.237417 0.287617 -0.194824 -0.251793 -0.144159 -0.123768 -0.187563 0.081306 0.099568 0.102461 0.098756 0.093648 0.102150 0.098669 0.093577 0.133892 0.145566 0.148868 0.150142 0.162336 0.150625 0.158319 0.148906 0.163205 0.161418 0.161530
qa: -0.0572 -0.0612 -0.2887 -0.4655 -0.3379 -0.1020 0.0879 0.0324 -0.0752 -0.2684 -0.2652 -0.2023 0.4057 0.0398 0.4328 0.0161 -0.2215 -0.2111 -0.2054 0.2588 -0.1150 -0.2374 0.2876 -0.1948 -0.2518 -0.1442 -0.1238 -0.1876 0.0813 0.0996 0.1025 0.0988 0.0936 0.1022 0.0987 0.0936 0.1339 0.1456 0.1489 0.1501 0.1623 0.1506 0.1583 0.1489 0.1632 0.1614 0.1615
va: 1.2684 1.2440 2.1317 2.0452 2.0701 3.1079 3.7388 3.8663 3.8451 3.9055 3.9086 3.8985 4.1636 4.2104 3.7043 3.5982 4.0838 3.9469 3.9589 3.7447 3.8972 4.0035 3.6757 3.9129 4.0118 3.8824 3.8768 3.9008 1.0473 1.0328 0.9991 1.0000 1.0184 1.0005 1.0012 1.0051 1.0171 1.0151 1.0144 1.0026 0.9880 1.0044 0.9969 1.0070 0.9887 0.9880 0.9893
dispcorr: -0.023271315 hartree
energy: -2050.696199483283
dipole: 15.41073 -15.81470 -0.40396 -3.94967 3.04592 -0.90375 -16.85865 16.58855 -0.27010
magnitude: 1.02611 au
magnitude: 2.60816 debye
