program: Orca
programVersion: 5.0.2
elementType: Cl Cl O O O N C C C C C C C C C C C C C C C C C C C C C C H H H H H H H H H H H H H H H H H H H
charge: 0
multiplicity: 1
keywords: wb97x-d3
keywords: def2-TZVPP
keywords: def2/J RIJCOSX
keywords: DEFGRID2
keywords: scfconv7
keywords: smallprint printgap noloewdin
keywords: NOSOSCF
formula: C22H19Cl2NO3
InChI: InChI=1/C22H19Cl2NO3/c1-22(2)17(12-19(23)24)20(22)21(26)28-18(13-25)14-7-6-10-16(11-14)27-15-8-4-3-5-9-15/h3-12,17-18,20H,1-2H3
47 atoms
Cl -3.766661 -0.366077 2.205703
Cl -5.040119 0.397407 -0.265578
O  1.854452 -1.724266 -0.945751
O  1.246436 -1.661897 1.2057
O  2.045878 3.285278 -0.451613
N  4.618586 -2.004547 -2.710542
C  -1.278742 -3.124854 -0.076524
C  -1.616944 -1.727334 0.360614
C  -0.404901 -1.963361 -0.512643
C  -0.799949 -4.094306 0.974324
C  -2.085481 -3.783025 -1.16857
C  -2.761396 -1.007322 -0.213045
C  0.943538 -1.768542 0.044632
C  -3.718316 -0.410839 0.485432
C  3.201493 -1.491214 -0.575042
C  3.465855 -0.065302 -0.138432
C  3.982016 -1.788672 -1.777143
C  2.617042 0.955511 -0.533725
C  4.584986 0.204501 0.639268
C  2.872864 2.250162 -0.102007
C  4.850852 1.510351 1.020389
C  3.990738 2.539427 0.664418
C  0.686585 3.094027 -0.363278
C  0.111843 2.400179 0.695501
C  -0.101951 3.661118 -1.352739
C  -1.267751 2.270485 0.748843
C  -1.482473 3.531851 -1.27966
C  -2.070842 2.832638 -0.235268
H  -1.39859 -1.51634 1.401549
H  -0.500111 -1.69289 -1.558259
H  -1.651324 -4.654986 1.363331
H  -0.316659 -3.611232 1.820614
H  -0.100118 -4.81433 0.547072
H  -1.513142 -4.595879 -1.61791
H  -2.361784 -3.09678 -1.96759
H  -3.002443 -4.209906 -0.758758
H  -2.843895 -0.96355 -1.292668
H  3.524779 -2.186364 0.207546
H  1.75554 0.757517 -1.159376
H  5.241683 -0.599415 0.947532
H  5.722015 1.728271 1.623291
H  4.181271 3.555321 0.985313
H  0.725048 1.965494 1.474826
H  0.359434 4.199024 -2.171148
H  -1.71395 1.732024 1.574708
H  -2.097747 3.974522 -2.051985
H  -3.146303 2.728989 -0.186236
elementType: Cl O N C H
totalener: -2050.67277312 hartree
nucrepener: 2890.06768004 hartree
electener: -4940.74045316 hartree
oneelecener: -8555.29380907 hartree
twoeener: 3614.55335591 hartree
cpcmener: -0.03680347 hartree
kineticenergy: 2044.45498853 hartree
xcener: -151.864716063929 hartree
chargesum: 0.0000000
charge: -0.060658 -0.060672 -0.286285 -0.457990 -0.343189 -0.099953 0.094541 0.021468 -0.061909 -0.265606 -0.261201 -0.187766 0.385189 0.024618 0.408031 0.013806 -0.219255 -0.155254 -0.215080 0.214275 -0.120512 -0.221084 0.283872 -0.183253 -0.245053 -0.171785 -0.129920 -0.176143 0.086078 0.103170 0.100269 0.092493 0.103958 0.099960 0.092105 0.101828 0.138658 0.151380 0.153733 0.151109 0.162855 0.151517 0.153825 0.148079 0.164600 0.160810 0.160345
qa: -0.0607 -0.0607 -0.2863 -0.4580 -0.3432 -0.1000 0.0945 0.0215 -0.0619 -0.2656 -0.2612 -0.1878 0.3852 0.0246 0.4080 0.0138 -0.2193 -0.1553 -0.2151 0.2143 -0.1205 -0.2211 0.2839 -0.1833 -0.2451 -0.1718 -0.1299 -0.1761 0.0861 0.1032 0.1003 0.0925 0.1040 0.1000 0.0921 0.1018 0.1387 0.1514 0.1537 0.1511 0.1629 0.1515 0.1538 0.1481 0.1646 0.1608 0.1603
va: 1.2617 1.2440 2.1180 2.0411 2.0641 3.1112 3.7878 3.8408 3.8354 3.9046 3.9063 3.8351 4.1576 4.1760 3.7061 3.6183 4.0732 3.9196 3.9867 3.7739 3.8891 4.0075 3.6743 3.8910 4.0144 3.8497 3.9221 3.8508 1.0432 1.0322 1.0001 1.0165 0.9995 1.0019 1.0046 1.0012 1.0146 1.0145 1.0114 1.0002 0.9874 1.0026 1.0027 1.0067 0.9978 0.9884 1.0044
dispcorr: -0.028217705 hartree
energy: -2050.700990827724
dipole: 12.71563 -13.52250 -0.80687 -10.96217 10.11676 -0.84542 -3.19087 3.60773 0.41685
magnitude: 1.24078 au
magnitude: 3.15381 debye
