program: Orca
programVersion: 5.0.2
elementType: Cl Cl O O O N C C C C C C C C C C C C C C C C C C C C C C H H H H H H H H H H H H H H H H H H H
charge: 0
multiplicity: 1
keywords: wb97x-d3
keywords: def2-TZVPP
keywords: def2/J RIJCOSX
keywords: DEFGRID2
keywords: scfconv7
keywords: smallprint printgap noloewdin
keywords: NOSOSCF
formula: C22H19Cl2NO3
InChI: InChI=1/C22H19Cl2NO3/c1-22(2)17(12-19(23)24)20(22)21(26)28-18(13-25)14-7-6-10-16(11-14)27-15-8-4-3-5-9-15/h3-12,17-18,20H,1-2H3
47 atoms
Cl -3.7321 -2.432516 -2.878509
Cl -4.44213 -4.700662 -1.243146
O  1.74506 -1.610123 0.189086
O  0.672916 -0.271177 -1.245736
O  2.302264 2.963595 2.331716
N  3.306301 -1.289435 -2.865757
C  -1.688662 -0.783235 0.799317
C  -1.903032 -1.615344 -0.429927
C  -0.56193 -1.658153 0.280374
C  -1.6406 0.714306 0.628885
C  -2.282327 -1.202634 2.121549
C  -2.720728 -2.834064 -0.407524
C  0.629554 -1.088854 -0.361886
C  -3.513749 -3.25627 -1.383485
C  3.006612 -1.17455 -0.267462
C  3.436933 0.185403 0.252576
C  3.119131 -1.228668 -1.732274
C  2.619505 0.96138 1.057127
C  4.724974 0.61756 -0.055124
C  3.090379 2.1857 1.519497
C  5.184417 1.828141 0.43281
C  4.364601 2.629078 1.216654
C  1.083263 3.381236 1.857916
C  0.841786 3.598512 0.506735
C  0.096046 3.626259 2.80345
C  -0.404876 4.061597 0.109025
C  -1.141842 4.095499 2.389706
C  -1.401002 4.31186 1.042543
H  -1.911505 -1.054231 -1.35757
H  -0.36725 -2.542732 0.875246
H  -2.637656 1.125508 0.795241
H  -1.322488 1.02752 -0.362525
H  -0.972107 1.165587 1.364785
H  -3.327419 -0.895418 2.184709
H  -1.744144 -0.718991 2.93803
H  -2.235758 -2.277014 2.292309
H  -2.675169 -3.453547 0.4801
H  3.708456 -1.923867 0.111037
H  1.628372 0.640776 1.353866
H  5.374969 0.004986 -0.668381
H  6.187337 2.157094 0.19649
H  4.713966 3.582525 1.591037
H  1.609225 3.4185 -0.235088
H  0.298368 3.453104 3.852926
H  -0.592331 4.229139 -0.943563
H  -1.909943 4.284536 3.128068
H  -2.3698 4.671778 0.723481
elementType: Cl O N C H
totalener: -2050.67144698 hartree
nucrepener: 2821.90082712 hartree
electener: -4872.57227410 hartree
oneelecener: -8419.45883280 hartree
twoeener: 3546.88655871 hartree
cpcmener: -0.04129547 hartree
kineticenergy: 2044.43835245 hartree
xcener: -151.865019747336 hartree
chargesum: 0.0000000
charge: -0.055742 -0.061208 -0.283101 -0.448922 -0.341226 -0.101685 0.122948 0.025015 -0.062457 -0.285149 -0.272137 -0.197810 0.378813 0.035329 0.452902 -0.011659 -0.227585 -0.195077 -0.226607 0.238707 -0.123471 -0.206170 0.261068 -0.165516 -0.211204 -0.176533 -0.143145 -0.173564 0.082246 0.099321 0.110149 0.101063 0.073041 0.102485 0.100080 0.095500 0.132266 0.158416 0.164181 0.146777 0.162769 0.150581 0.152396 0.146238 0.160618 0.158575 0.158486
qa: -0.0557 -0.0612 -0.2831 -0.4489 -0.3412 -0.1017 0.1229 0.0250 -0.0625 -0.2851 -0.2721 -0.1978 0.3788 0.0353 0.4529 -0.0117 -0.2276 -0.1951 -0.2266 0.2387 -0.1235 -0.2062 0.2611 -0.1655 -0.2112 -0.1765 -0.1431 -0.1736 0.0822 0.0993 0.1101 0.1011 0.0730 0.1025 0.1001 0.0955 0.1323 0.1584 0.1642 0.1468 0.1628 0.1506 0.1524 0.1462 0.1606 0.1586 0.1585
va: 1.2704 1.2436 2.1427 2.0457 2.0593 3.1023 3.7412 3.9158 3.8503 3.8960 3.9049 3.8942 4.1638 4.2117 3.8007 3.7003 4.0766 3.9617 3.9840 3.7709 3.8878 4.0085 3.6813 3.8224 3.9444 3.8553 3.8832 3.8402 1.0454 1.0353 1.0013 1.0119 1.0079 1.0009 0.9995 1.0058 1.0182 0.9937 0.9895 1.0049 0.9886 1.0027 1.0011 1.0076 0.9913 0.9892 0.9906
dispcorr: -0.027405531 hartree
energy: -2050.698852507191
dipole: 11.95317 -11.81330 0.13987 26.46137 -26.46259 -0.00122 22.67523 -19.68393 2.99130
magnitude: 2.99457 au
magnitude: 7.61160 debye
