program: Orca
programVersion: 5.0.2
elementType: Cl Cl O O O N C C C C C C C C C C C C C C C C C C C C C C H H H H H H H H H H H H H H H H H H H
charge: 0
multiplicity: 1
keywords: wb97x-d3
keywords: def2-TZVPP
keywords: def2/J RIJCOSX
keywords: DEFGRID2
keywords: scfconv7
keywords: smallprint printgap noloewdin
keywords: NOSOSCF
formula: C22H19Cl2NO3
InChI: InChI=1/C22H19Cl2NO3/c1-22(2)17(12-19(23)24)20(22)21(26)28-18(13-25)14-7-6-10-16(11-14)27-15-8-4-3-5-9-15/h3-12,17-18,20H,1-2H3
47 atoms
Cl -3.064366 -4.154754 3.111037
Cl -5.440896 -2.694742 2.370938
O  0.7466 -0.865002 -1.07475
O  0.970885 -2.26393 0.658756
O  1.401309 4.199047 0.418492
N  2.8715 0.274438 -3.33067
C  -1.553295 -3.432633 -0.994533
C  -1.875852 -3.036884 0.421471
C  -1.134705 -2.072469 -0.472677
C  -0.525159 -4.518367 -1.193991
C  -2.63302 -3.437534 -2.04765
C  -3.243124 -2.706937 0.84052
C  0.283291 -1.773037 -0.200599
C  -3.825839 -3.129704 1.954927
C  2.110794 -0.467977 -0.9437
C  2.270687 0.660812 0.043568
C  2.521518 -0.054895 -2.286263
C  1.756023 1.915986 -0.25869
C  2.904343 0.430839 1.256941
C  1.903421 2.947358 0.656335
C  3.023819 1.468035 2.170916
C  2.53373 2.729597 1.874073
C  1.547587 4.753224 -0.832019
C  0.474552 5.469825 -1.340556
C  2.73698 4.651321 -1.543202
C  0.596308 6.093207 -2.575036
C  2.839778 5.270369 -2.780491
C  1.773583 5.990848 -3.302911
H  -1.26308 -3.52728 1.169265
H  -1.699057 -1.239149 -0.876862
H  0.202016 -4.573644 -0.385813
H  0.016481 -4.370537 -2.129964
H  -1.023204 -5.48748 -1.250814
H  -2.184379 -3.379217 -3.040622
H  -3.327246 -2.603539 -1.954684
H  -3.209106 -4.363102 -1.99811
H  -3.831976 -2.066565 0.194698
H  2.742903 -1.313663 -0.657415
H  1.251934 2.091604 -1.20252
H  3.305171 -0.547703 1.485808
H  3.515873 1.297183 3.118785
H  2.640197 3.542971 2.580257
H  -0.445417 5.541569 -0.774552
H  3.579146 4.101512 -1.142218
H  -0.24072 6.652709 -2.971595
H  3.765075 5.19063 -3.33583
H  1.861729 6.471307 -4.268046
elementType: Cl O N C H
totalener: -2050.67262412 hartree
nucrepener: 2686.06199372 hartree
electener: -4736.73461784 hartree
oneelecener: -8147.74886388 hartree
twoeener: 3411.01424604 hartree
cpcmener: -0.03625873 hartree
kineticenergy: 2044.44660985 hartree
xcener: -151.858502123069 hartree
chargesum: 0.0000000
charge: -0.058215 -0.062053 -0.280031 -0.465216 -0.342158 -0.101919 0.089175 0.026408 -0.096214 -0.260552 -0.263084 -0.202654 0.421704 0.038385 0.426496 0.009043 -0.226298 -0.171826 -0.182703 0.209631 -0.127684 -0.217935 0.268511 -0.244148 -0.175368 -0.128321 -0.153848 -0.184225 0.076870 0.105669 0.092282 0.102281 0.100776 0.099195 0.092586 0.101463 0.135303 0.142654 0.147828 0.149650 0.162633 0.151860 0.149125 0.158954 0.161760 0.162517 0.161691
qa: -0.0582 -0.0621 -0.2800 -0.4652 -0.3422 -0.1019 0.0892 0.0264 -0.0962 -0.2606 -0.2631 -0.2027 0.4217 0.0384 0.4265 0.0090 -0.2263 -0.1718 -0.1827 0.2096 -0.1277 -0.2179 0.2685 -0.2441 -0.1754 -0.1283 -0.1538 -0.1842 0.0769 0.1057 0.0923 0.1023 0.1008 0.0992 0.0926 0.1015 0.1353 0.1427 0.1478 0.1497 0.1626 0.1519 0.1491 0.1590 0.1618 0.1625 0.1617
va: 1.2668 1.2427 2.1367 2.0451 2.0596 3.1056 3.7539 3.8665 3.8334 3.9094 3.9027 3.8939 4.1873 4.2041 3.7093 3.6009 4.0817 3.9593 3.9319 3.7822 3.9061 4.0102 3.6935 4.0031 3.8839 3.8815 3.8914 3.8940 1.0510 1.0304 1.0149 1.0002 1.0001 1.0015 1.0052 1.0010 1.0155 1.0168 1.0101 1.0086 0.9883 1.0027 1.0066 0.9961 0.9877 0.9893 0.9891
dispcorr: -0.023165705 hartree
energy: -2050.695789823838
dipole: 17.94231 -18.15406 -0.21175 10.80473 -10.90360 -0.09887 -23.42410 23.08940 -0.33469
magnitude: 0.40821 au
magnitude: 1.03758 debye
