program: Gaussian 09
title: 000074475
version: EM64L-G09RevD.01
frameworkgroup: C1[X(C12H6Cl2N2O6S)]
method: RPBEPBE
basis: SDD
operation: Freq
keyword: #p
keyword: freq=noraman
keyword: PBEPBE/SDD
title: #p freq=noraman PBEPBE/SDD
converged: YES YES NO NO
title: Mulliken charges:
elementType: Cl Cl S O O O O O O N N C C C C C C C C C C C C H H H H H H
charge: 0.068949 0.068855 0.881446 -0.509827 -0.509712 -0.184546 -0.184434 -0.157776 -0.157735 0.008854 0.008765 -0.047133 -0.047160 -0.345695 -0.345739 -0.235911 -0.235799 0.554407 0.554590 -0.163934 -0.164018 -0.330386 -0.330446 0.323793 0.323870 0.297727 0.297599 0.280701 0.280696
chargesum: 0.00000
title: Mulliken charges with hydrogens summed into heavy atoms:
elementType: Cl Cl S O O O O O O N N C C C C C C C C C C C C
charge: 0.068949 0.068855 0.881446 -0.509827 -0.509712 -0.184546 -0.184434 -0.157776 -0.157735 0.008854 0.008765 -0.047133 -0.047160 -0.021902 -0.021869 0.061816 0.061800 0.554407 0.554590 0.116767 0.116678 -0.330386 -0.330446
polarizability: 2.92497525e+02 -3.32050310e+00 2.17295538e+02 -5.58553378e-02 2.86884748e-01 1.50297773e+02
1716.lowfreq: -2.7338 0.0014 0.0015 0.0026 4.7457 6.3126 14.2056 22.3494 22.8808
frequency: 14.2033 22.3347 22.7927 44.4535 45.4926 75.8709 91.0496 95.1996 119.4570 140.0293 147.9113 185.3825 189.8746 209.6416 209.7256 221.9322 257.9491 272.3110 298.8267 336.4022 339.2386 356.7117 394.9192 395.2977 420.8875 420.9943 431.2227 472.0540 478.4375 509.7835 545.0116 580.6165 592.0500 642.7057 644.1694 678.5692 679.7235 704.2787 709.5295 733.9664 735.0934 782.1731 810.8542 816.3418 843.0109 843.5407 925.0839 928.9259 938.1927 976.4051 978.1136 1017.1657 1021.0775 1067.8117 1072.0085 1110.7457 1112.2942 1144.0897 1145.4286 1204.1419 1204.8051 1243.7520 1244.7564 1359.7897 1362.6869 1380.3625 1382.3855 1396.3641 1397.1913 1439.4483 1442.3054 1570.4117 1570.6257 1587.0465 1590.9290 3159.2282 3159.4299 3164.9855 3165.1903 3180.9052 3181.0410
redmass: 10.6357 17.1126 11.5470 16.0341 16.3557 9.4267 13.1279 7.6311 9.2694 5.7697 7.6358 17.5891 16.0730 15.2307 15.2373 16.0354 12.9712 8.8465 9.2959 7.9381 11.7305 8.5575 11.1375 8.2164 4.5297 5.2021 5.8997 8.2810 5.3193 4.8674 7.5528 6.6188 6.7086 7.7877 7.8893 5.8028 5.9654 9.5572 10.1134 5.0550 4.9894 14.9041 9.9194 9.7858 1.3406 1.3562 1.6154 1.5004 9.5676 1.3660 1.3644 8.4252 8.3152 2.3164 2.3365 3.1742 3.1451 1.3738 1.3644 12.5038 12.8496 1.2950 1.3209 3.7497 3.7845 11.3459 10.7562 7.2686 6.9722 2.5484 2.5265 7.2600 7.3232 8.1698 8.3485 1.0901 1.0902 1.0921 1.0922 1.0966 1.0967
irintensity: 2.1676 0.0999 2.0521 0.5553 0.0258 2.7962 5.7728 1.0828 0.0251 3.1851 1.0865 0.2857 0.0417 3.0509 7.7187 0.0176 0.0761 8.5626 4.0351 0.0280 6.6853 1.1221 20.2279 17.4869 12.4616 24.8083 48.9133 0.5301 0.3045 41.5232 114.9627 3.9639 13.0561 2.0813 30.6283 0.2174 1.8484 1.3897 41.6852 1.7610 4.9035 60.6237 53.5474 66.0923 15.4809 19.0352 17.0255 19.5511 46.3619 0.1304 0.0352 116.4795 34.4829 46.7110 6.3281 12.1023 10.6002 0.9293 18.6733 382.8757 19.2060 1.5535 22.7379 3.3370 21.0736 1.2336 60.7217 5.7707 118.7042 163.3747 16.8834 24.1612 10.7196 5.1934 19.2101 1.5834 5.9381 25.5791 6.0868 1.9568 0.9629
temp: 298.150 k
press: 1.00000 atm
elementType: 17 17 16 8 8 8 8 8 8 7 7 6 6 6 6 6 6 6 6 6 6 6 6 1 1 1 1 1 1
symmnumber: 1
zpe: 438952.6 jmol-1
zpe.correction: 0.167188 hartree
zpe.thermalcorrener: 0.188528 hartree
zpe.thermalcorrenthalpy: 0.189472 hartree
zpe.thermalcorrgfe: 0.112713 hartree
zpe.sumelectzpe: -2337.902198 hartree
zpe.sumelectthermal: -2337.880858 hartree
zpe.sumelectthermalent: -2337.879914 hartree
zpe.sumelectthermalfe: -2337.956673 hartree
dipole: 0.0068 0.0097 -2.2890
dipole: 2.2890
quadrupole: -183.3304 -153.3929 -169.4136
quadrupole: -29.2416 -0.1243 0.0800
quadrupole: -14.6181 15.3194 -0.7013 -29.2416 -0.1243 0.0800
hfenergy: -2338.0693862 hartree
pointgroup: C01 [X(C12H6Cl2N2O6S1)]
dipole: 0.0035269 -0.0044448 -0.9005444 debye
polarizability: 291.5243108|-9.1243067|218.2683998|0.1363024|-0.3226178|150.2981258 unknown
InChI: InChI=1S/C12H6Cl2N2O6S/c13-9-3-1-7(5-11(9)15(17)18)23(21,22)8-2-4-10(14)12(6-8)16(19)20/h1-6H
charge 0 multiplicity 1
29 atoms
Cl 4.895149 -1.808889 -1.824578
Cl -4.888317 1.794405 -1.850339
S  -0.001634 0.006748 2.014244
O  -0.471798 -1.360613 2.774912
O  0.466208 1.379192 2.766997
O  3.867653 2.380171 -0.831517
O  -3.868023 -2.385806 -0.821476
O  5.609077 0.903404 -0.87635
O  -5.608117 -0.907679 -0.876147
N  4.369429 1.195601 -0.716413
N  -4.368669 -1.199984 -0.714737
C  1.425268 -0.493212 0.86363
C  -1.42525 0.498573 0.856133
C  2.328883 0.495021 0.46999
C  -2.329171 -0.492058 0.469226
C  1.558995 -1.847735 0.516749
C  -1.556682 1.850199 0.497289
C  3.423503 0.108204 -0.336273
C  -3.421749 -0.110831 -0.342395
C  2.644821 -2.214944 -0.303489
C  -2.640393 2.211585 -0.328362
C  3.579078 -1.244562 -0.734944
C  -3.574827 1.238528 -0.753257
H  2.225196 1.537614 0.787475
H  -2.227054 -1.531971 0.795892
H  0.84976 -2.592552 0.892198
H  -0.847504 2.597528 0.867808
H  2.776523 -3.255096 -0.613718
H  -2.770257 3.249159 -0.647846
