program: Orca
programVersion: 5.0.2
elementType: Cl Cl O O O N C C C C C C C C C C C C C C C C C C C C C C H H H H H H H H H H H H H H H H H H H
charge: 0
multiplicity: 1
keywords: wb97x-d3
keywords: def2-TZVPP
keywords: def2/J RIJCOSX
keywords: DEFGRID2
keywords: scfconv7
keywords: smallprint printgap noloewdin
keywords: NOSOSCF
formula: C22H19Cl2NO3
InChI: InChI=1/C22H19Cl2NO3/c1-22(2)17(12-19(23)24)20(22)21(26)28-18(13-25)14-7-6-10-16(11-14)27-15-8-4-3-5-9-15/h3-12,17-18,20H,1-2H3
47 atoms
Cl -3.13055 0.062228 2.554329
Cl -4.893319 0.576657 0.330802
O  1.585039 -1.75537 -1.008185
O  1.223327 -2.083616 1.175985
O  1.632236 3.157423 0.255032
N  4.176799 -1.938051 -3.03056
C  -1.466497 -3.350178 0.05748
C  -1.726309 -1.975787 0.598415
C  -0.595125 -2.193506 -0.392209
C  -0.939415 -4.389633 1.014825
C  -2.366749 -3.930658 -1.005729
C  -2.877015 -1.173351 0.167866
C  0.795685 -2.020722 0.051847
C  -3.534981 -0.30261 0.9221
C  2.954448 -1.506924 -0.760717
C  3.243413 -0.089017 -0.302329
C  3.622259 -1.749896 -2.040907
C  2.24085 0.86922 -0.261493
C  4.547343 0.228861 0.052447
C  2.557144 2.160074 0.14632
C  4.847711 1.525176 0.441521
C  3.860763 2.495416 0.490929
C  0.354218 2.966778 -0.227459
C  0.120872 2.878643 -1.592578
C  -0.689396 2.920217 0.682913
C  -1.182832 2.735734 -2.045732
C  -1.99067 2.79284 0.215486
C  -2.240412 2.692105 -1.146063
H  -1.405787 -1.82982 1.623848
H  -0.781705 -1.858099 -1.405592
H  -0.301047 -5.105844 0.49502
H  -1.777143 -4.944335 1.440511
H  -0.374453 -3.968923 1.843361
H  -2.660245 -3.202961 -1.760485
H  -3.273925 -4.33989 -0.558604
H  -1.854125 -4.743891 -1.521483
H  -3.225812 -1.293867 -0.850574
H  3.366349 -2.221193 -0.038945
H  1.226761 0.623856 -0.545618
H  5.324056 -0.525705 0.018343
H  5.863097 1.784634 0.709602
H  4.095518 3.506404 0.798225
H  0.945069 2.921073 -2.293886
H  -0.487659 2.994254 1.743914
H  -1.370811 2.663542 -3.108847
H  -2.809388 2.77323 0.922466
H  -3.2547 2.585606 -1.506651
elementType: Cl O N C H
totalener: -2050.67255973 hartree
nucrepener: 2898.58226810 hartree
electener: -4949.25482783 hartree
oneelecener: -8572.47303852 hartree
twoeener: 3623.21821069 hartree
cpcmener: -0.03639260 hartree
kineticenergy: 2044.44201529 hartree
xcener: -151.863398754567 hartree
chargesum: -0.0000000
charge: -0.057767 -0.061095 -0.287689 -0.457387 -0.333497 -0.100512 0.085391 0.051675 -0.074885 -0.266695 -0.269784 -0.209453 0.393908 0.044810 0.403303 0.018002 -0.217392 -0.200222 -0.259470 0.315343 -0.097159 -0.258520 0.262954 -0.188005 -0.209063 -0.150282 -0.120510 -0.169214 0.082901 0.100636 0.102390 0.100469 0.092575 0.094438 0.102906 0.098877 0.132227 0.147049 0.136640 0.150251 0.161099 0.147561 0.156942 0.147863 0.162457 0.143407 0.152526
qa: -0.0578 -0.0611 -0.2877 -0.4574 -0.3335 -0.1005 0.0854 0.0517 -0.0749 -0.2667 -0.2698 -0.2095 0.3939 0.0448 0.4033 0.0180 -0.2174 -0.2002 -0.2595 0.3153 -0.0972 -0.2585 0.2630 -0.1880 -0.2091 -0.1503 -0.1205 -0.1692 0.0829 0.1006 0.1024 0.1005 0.0926 0.0944 0.1029 0.0989 0.1322 0.1470 0.1366 0.1503 0.1611 0.1476 0.1569 0.1479 0.1625 0.1434 0.1525
va: 1.2666 1.2433 2.1130 2.0475 2.0796 3.1122 3.7829 3.8518 3.8293 3.9031 3.9099 3.9082 4.1493 4.2083 3.7021 3.6846 4.0520 3.9356 4.0077 3.7218 3.8888 4.0062 3.6926 3.9418 4.0246 3.9173 3.8174 3.8599 1.0463 1.0330 0.9996 0.9996 1.0176 1.0054 1.0005 1.0012 1.0199 1.0181 1.0241 1.0010 0.9876 1.0076 0.9968 1.0073 0.9890 1.0129 1.0025
dispcorr: -0.027611104 hartree
energy: -2050.700170832271
dipole: 9.84806 -10.98457 -1.13651 -13.79353 12.98479 -0.80874 -7.75255 7.71258 -0.03997
magnitude: 1.39546 au
magnitude: 3.54698 debye
