program: Orca
programVersion: 5.0.2
elementType: Cl Cl O O O N C C C C C C C C C C C C C C C C C C C C C C H H H H H H H H H H H H H H H H H H H
charge: 0
multiplicity: 1
keywords: wb97x-d3
keywords: def2-TZVPP
keywords: def2/J RIJCOSX
keywords: DEFGRID2
keywords: scfconv7
keywords: smallprint printgap noloewdin
keywords: NOSOSCF
formula: C22H19Cl2NO3
InChI: InChI=1/C22H19Cl2NO3/c1-22(2)17(12-19(23)24)20(22)21(26)28-18(13-25)14-7-6-10-16(11-14)27-15-8-4-3-5-9-15/h3-12,17-18,20H,1-2H3
47 atoms
Cl -2.671334 0.687634 0.002399
Cl -5.063308 -0.756005 -0.723023
O  1.3227 -1.739152 -0.217124
O  1.452168 -3.54129 -1.519319
O  1.640806 3.115294 1.253378
N  2.676583 -0.724197 -3.159828
C  -0.933154 -3.379408 1.167564
C  -1.418818 -2.169594 0.425461
C  -0.538272 -3.185232 -0.283632
C  0.072123 -3.167065 2.273382
C  -1.868862 -4.531441 1.440214
C  -2.80982 -2.011145 -0.014371
C  0.829172 -2.871016 -0.735756
C  -3.420012 -0.848711 -0.210417
C  2.621156 -1.339645 -0.615613
C  3.004271 -0.110106 0.171976
C  2.632097 -1.019102 -2.05052
C  2.087877 0.924924 0.331392
C  4.285142 -0.013576 0.692622
C  2.47559 2.068088 1.0161
C  4.653725 1.134174 1.382462
C  3.759298 2.176271 1.543201
C  0.559646 3.355434 0.444485
C  0.688942 3.453406 -0.935097
C  -0.663133 3.570849 1.061027
C  -0.428293 3.758542 -1.698542
C  -1.769477 3.89155 0.285823
C  -1.658835 3.978809 -1.094439
H  -0.921103 -1.24855 0.702492
H  -1.036921 -3.855728 -0.974593
H  0.752574 -4.01738 2.346427
H  -0.44973 -3.080894 3.228157
H  0.668265 -2.265412 2.150114
H  -2.495711 -4.317405 2.307934
H  -1.296329 -5.434223 1.659812
H  -2.523934 -4.762857 0.601044
H  -3.392267 -2.90409 -0.206666
H  3.349854 -2.137869 -0.444792
H  1.086683 0.839144 -0.073688
H  4.990277 -0.824504 0.56332
H  5.650633 1.218884 1.794172
H  4.046422 3.073143 2.077566
H  1.647779 3.297198 -1.413525
H  -0.746138 3.496654 2.137884
H  -0.330073 3.831577 -2.77381
H  -2.722924 4.065957 0.766882
H  -2.525084 4.219172 -1.696484
elementType: Cl O N C H
totalener: -2050.68494650 hartree
nucrepener: 2883.30059301 hartree
electener: -4933.98553951 hartree
oneelecener: -8541.98624336 hartree
twoeener: 3608.00070385 hartree
cpcmener: -0.03361320 hartree
kineticenergy: 2044.47349791 hartree
xcener: -151.866573018696 hartree
chargesum: -0.0000000
charge: -0.057419 -0.063597 -0.277748 -0.433099 -0.323470 -0.087445 0.084909 0.048180 -0.083839 -0.258366 -0.279631 -0.211771 0.412274 0.051598 0.388430 0.003832 -0.226593 -0.198810 -0.206848 0.277965 -0.113200 -0.234932 0.285930 -0.192420 -0.218887 -0.137144 -0.184911 -0.153026 0.080561 0.101423 0.101810 0.097512 0.090703 0.102649 0.099034 0.093577 0.127075 0.134028 0.128416 0.144956 0.158159 0.148358 0.157627 0.145908 0.159950 0.160058 0.158233
qa: -0.0574 -0.0636 -0.2777 -0.4331 -0.3235 -0.0874 0.0849 0.0482 -0.0838 -0.2584 -0.2796 -0.2118 0.4123 0.0516 0.3884 0.0038 -0.2266 -0.1988 -0.2068 0.2780 -0.1132 -0.2349 0.2859 -0.1924 -0.2189 -0.1371 -0.1849 -0.1530 0.0806 0.1014 0.1018 0.0975 0.0907 0.1026 0.0990 0.0936 0.1271 0.1340 0.1284 0.1450 0.1582 0.1484 0.1576 0.1459 0.1599 0.1601 0.1582
va: 1.2916 1.2424 2.1564 2.0755 2.0915 3.1103 3.7644 3.8461 3.8521 3.9076 3.9148 3.8929 4.1796 4.2148 3.7660 3.7430 4.0218 3.9317 3.9650 3.7529 3.9087 3.9959 3.6694 3.9220 3.9515 3.8867 3.8390 3.8429 1.0237 1.0273 1.0002 1.0006 1.0113 0.9998 1.0009 1.0055 1.0220 1.0207 1.0281 1.0032 0.9897 1.0059 0.9964 1.0066 0.9893 0.9927 0.9895
dispcorr: -0.026453289 hartree
energy: -2050.711399786928
dipole: 14.57437 -14.71853 -0.14416 -9.56990 8.93678 -0.63312 13.25187 -10.71575 2.53612
magnitude: 2.61793 au
magnitude: 6.65425 debye
