program: Orca
programVersion: 5.0.2
elementType: Cl Cl O O O N C C C C C C C C C C C C C C C C C C C C C C H H H H H H H H H H H H H H H H H H H
charge: 0
multiplicity: 1
keywords: wb97x-d3
keywords: def2-TZVPP
keywords: def2/J RIJCOSX
keywords: DEFGRID2
keywords: scfconv7
keywords: smallprint printgap noloewdin
keywords: NOSOSCF
formula: C22H19Cl2NO3
InChI: InChI=1/C22H19Cl2NO3/c1-22(2)17(12-19(23)24)20(22)21(26)28-18(13-25)14-7-6-10-16(11-14)27-15-8-4-3-5-9-15/h3-12,17-18,20H,1-2H3
47 atoms
Cl -1.191363 -0.137442 0.897341
Cl -4.030458 0.098252 0.401652
O  1.519877 -2.224615 -0.914615
O  1.380371 -3.097595 1.141685
O  1.108832 2.920441 -1.093714
N  4.122137 -1.471061 -2.805518
C  -1.306224 -4.391879 0.05188
C  -1.569074 -3.116114 0.767376
C  -0.513954 -3.150176 -0.326186
C  -0.652191 -5.520386 0.808862
C  -2.287791 -4.858644 -0.995294
C  -2.762358 -2.269602 0.556672
C  0.870424 -2.8636 0.075946
C  -2.684751 -0.947075 0.615488
C  2.757029 -1.600173 -0.582408
C  2.504281 -0.22946 -0.001948
C  3.51135 -1.535373 -1.835209
C  1.910294 0.75026 -0.78832
C  2.786866 0.019024 1.333722
C  1.621325 1.99118 -0.240485
C  2.486204 1.262681 1.871239
C  1.908189 2.255067 1.095243
C  0.295103 3.927694 -0.646121
C  -0.790772 3.682978 0.184806
C  0.550773 5.206104 -1.120106
C  -1.618626 4.735447 0.545989
C  -0.294182 6.247422 -0.762085
C  -1.377115 6.019363 0.075224
H  -1.156449 -3.062902 1.771936
H  -0.802812 -2.703531 -1.270554
H  -0.058898 -6.144255 0.138244
H  -1.41953 -6.155073 1.255832
H  -0.003969 -5.177748 1.612313
H  -3.107729 -5.409686 -0.530489
H  -1.800637 -5.528803 -1.705289
H  -2.719342 -4.034657 -1.564602
H  -3.726773 -2.72734 0.369155
H  3.339273 -2.208566 0.115834
H  1.673998 0.56451 -1.830369
H  3.238226 -0.747825 1.949807
H  2.708897 1.466917 2.91021
H  1.69565 3.222838 1.530743
H  -1.002141 2.683971 0.542429
H  1.397153 5.380925 -1.772457
H  -2.463803 4.543425 1.194414
H  -0.099035 7.242994 -1.139251
H  -2.031551 6.834232 0.355343
elementType: Cl O N C H
totalener: -2050.68227271 hartree
nucrepener: 2887.45112288 hartree
electener: -4938.13339559 hartree
oneelecener: -8550.78186357 hartree
twoeener: 3612.64846798 hartree
cpcmener: -0.02877421 hartree
kineticenergy: 2044.47925982 hartree
xcener: -151.865094549133 hartree
chargesum: 0.0000000
charge: -0.054941 -0.051691 -0.275555 -0.441892 -0.320086 -0.088569 0.140286 -0.029661 -0.118841 -0.268116 -0.276551 -0.231125 0.362031 0.097302 0.426244 0.013179 -0.229968 -0.260604 -0.178515 0.255301 -0.131081 -0.177002 0.259912 -0.165242 -0.223894 -0.171879 -0.135730 -0.164143 0.115941 0.110664 0.099742 0.096005 0.093033 0.102265 0.100156 0.092646 0.143663 0.131906 0.130566 0.145666 0.159942 0.155493 0.145311 0.145650 0.156454 0.157667 0.158062
qa: -0.0549 -0.0517 -0.2756 -0.4419 -0.3201 -0.0886 0.1403 -0.0297 -0.1188 -0.2681 -0.2766 -0.2311 0.3620 0.0973 0.4262 0.0132 -0.2300 -0.2606 -0.1785 0.2553 -0.1311 -0.1770 0.2599 -0.1652 -0.2239 -0.1719 -0.1357 -0.1641 0.1159 0.1107 0.0997 0.0960 0.0930 0.1023 0.1002 0.0926 0.1437 0.1319 0.1306 0.1457 0.1599 0.1555 0.1453 0.1456 0.1565 0.1577 0.1581
va: 1.3096 1.2584 2.1195 2.0620 2.0842 3.1102 3.7300 3.8646 3.8204 3.8855 3.9130 3.9240 4.2051 4.1543 3.7216 3.6163 4.0771 4.0549 3.9502 3.7727 3.9160 3.8995 3.6919 3.8754 3.9959 3.9450 3.8900 3.8895 1.0255 1.0267 0.9996 1.0011 1.0182 0.9994 1.0032 0.9995 1.0070 1.0202 1.0282 1.0081 0.9906 0.9967 1.0235 1.0073 0.9921 0.9893 0.9900
dispcorr: -0.027183219 hartree
energy: -2050.709455926961
dipole: 1.34182 -3.17453 -1.83270 -11.02831 10.61658 -0.41173 1.73313 -0.31020 1.42293
magnitude: 2.35649 au
magnitude: 5.98972 debye
