program: Gaussian 09
title: 000074405
version: EM64L-G09RevD.01
frameworkgroup: C1[X(C7H10Cl2N4)]
method: RPBEPBE
basis: SDD
operation: Freq
keyword: #p
keyword: freq=noraman
keyword: PBEPBE/SDD
title: #p freq=noraman PBEPBE/SDD
converged: YES YES NO NO
title: Mulliken charges:
elementType: Cl Cl N N N N C C C C C C C H H H H H H H H H H
charge: 0.018235 0.018243 -0.100542 0.003663 0.003707 0.109266 -0.357465 -0.357717 0.187144 -0.655325 -0.655206 -0.273528 -0.273542 0.262937 0.217093 0.263063 0.217148 0.211747 0.249909 0.224814 0.211745 0.249768 0.224842
chargesum: 0.00000
title: Mulliken charges with hydrogens summed into heavy atoms:
elementType: Cl Cl N N N N C C C C C C C
charge: 0.018235 0.018243 -0.100542 0.003663 0.003707 0.109266 0.122565 0.122494 0.187144 0.031145 0.031149 -0.273528 -0.273542
polarizability: 1.68059985e+02 2.11411381e-03 1.48930153e+02 -6.65157798e-03 4.74932541e+00 7.03084920e+01
1716.lowfreq: -3.6636 -0.0022 0.0016 0.0019 7.3506 8.9199 49.2084 51.1457 68.4650
frequency: 49.1409 50.9297 68.4620 90.3460 140.4899 159.0776 178.8729 182.9150 189.6891 222.6821 240.4897 304.9105 333.8913 347.0511 402.7297 435.6508 493.4559 535.4334 578.5076 616.9960 669.6338 750.2341 779.1696 784.6753 790.4553 795.6350 876.9529 940.8878 952.7944 1039.6817 1076.9543 1081.5917 1099.2621 1137.1683 1180.0952 1191.0858 1211.9640 1292.2146 1308.0083 1311.4432 1349.8971 1362.6095 1380.6814 1389.6601 1395.2203 1461.5751 1463.9528 1470.0840 1472.3692 1481.6699 1484.3780 1485.6634 1583.7775 2989.8045 2989.8625 3016.3357 3021.0106 3078.1133 3078.8537 3093.6275 3093.8819 3106.5708 3108.4095
redmass: 4.0213 2.8734 2.8019 5.1117 14.1434 2.3686 5.7470 12.3245 11.2060 1.0709 1.2693 3.4557 3.6218 3.3893 4.7326 13.3908 5.1048 3.4158 4.3955 12.3564 10.8979 3.1731 2.0799 4.7492 2.9582 1.3472 9.7108 2.1301 2.7461 2.9163 2.1426 1.8634 1.8157 7.2469 8.0305 2.3005 3.4446 2.5508 1.2654 2.1371 1.2332 1.2859 3.4575 1.2100 1.5499 1.0717 1.1333 1.0451 1.0617 1.4126 1.0580 2.8894 5.1053 1.0357 1.0358 1.0634 1.0634 1.1000 1.0999 1.0982 1.0990 1.1029 1.1032
irintensity: 0.0322 0.1738 0.1216 1.0961 0.0490 1.0910 0.1691 0.1092 0.4289 0.3907 0.7548 2.5833 5.8797 8.7611 0.0985 7.5419 7.5887 4.4514 3.6173 0.0754 1.6816 1.8267 29.4472 68.6197 73.6821 43.2872 9.0136 0.1258 7.5171 57.0937 14.3382 45.4789 8.2193 170.4805 138.4463 39.9200 6.2464 54.0645 9.8872 89.6181 3.7850 45.1897 450.8449 0.5777 96.0550 12.3450 20.1757 4.0145 0.0006 229.4113 21.9718 424.9106 636.9290 17.4140 29.5420 26.7335 41.4274 20.6031 0.1610 41.7126 15.0627 7.2741 41.8874
temp: 298.150 k
press: 1.00000 atm
elementType: 17 17 7 7 7 7 6 6 6 6 6 6 6 1 1 1 1 1 1 1 1 1 1
symmnumber: 1
zpe: 450092.8 jmol-1
zpe.correction: 0.171431 hartree
zpe.thermalcorrener: 0.185046 hartree
zpe.thermalcorrenthalpy: 0.185990 hartree
zpe.thermalcorrgfe: 0.129691 hartree
zpe.sumelectzpe: -1410.879204 hartree
zpe.sumelectthermal: -1410.865589 hartree
zpe.sumelectthermalent: -1410.864645 hartree
zpe.sumelectthermalfe: -1410.920944 hartree
dipole: 6.2545 -0.0004 -0.0002
dipole: 6.2545
quadrupole: -87.3841 -94.5632 -89.7343
quadrupole: -0.0031 0.0018 -1.1694
quadrupole: 3.1764 -4.0027 0.8263 -0.0031 0.0018 -1.1694
hfenergy: -1411.0506352 hartree
pointgroup: C01 [X(C7H10Cl2N4)]
dipole: -2.4606946 -0.0018974 -0.0006207 debye
dipolederiv: -0.3683855 -0.3513128 0.0729193 -0.4394942 -0.7240046 0.1343908 0.089008 0.1326122 -0.0979383 -0.3695775 0.3518818 -0.0731568 0.4400694 -0.72289 0.1343234 -0.0890664 0.1323238 -0.0979054 -1.5388348 -0.0007097 -0.0003535 -0.0011449 -0.5476561 -0.1023083 -0.0004471 -0.0541568 -0.3440144 -1.6781799 0.3042602 -0.0655991 0.52201 -0.6941424 0.1058904 -0.1354648 0.1075837 -0.167092 -1.6769634 -0.3056425 0.0650119 -0.5236191 -0.6953059 0.1055906 0.1352535 0.1078424 -0.1670063 -0.7900523 0.0007203 -0.0003931 0.0006937 -1.7030495 0.3191722 -0.0003093 0.329928 -0.1654275 0.3835852 -0.2034391 -0.0050992 -0.3995756 0.4267643 0.0686461 0.1600672 0.0419357 0.2108454 0.3821661 0.203619 0.0048774 0.4002756 0.4274982 0.069103 -0.1603052 0.0420796 0.2108036 2.3591742 0.0012319 0.0006196 0.0013479 0.5733499 -0.0830273 0.0004288 -0.0515744 0.2069391 -0.0024698 0.03494 0.0009104 0.0959299 -0.0091734 -0.0622468 -0.0550034 -0.0866143 -0.0454906 -0.0020869 -0.03524 -0.000978 -0.0962406 -0.0091062 -0.0621946 0.054968 -0.086424 -0.0455636 1.6994343 0.2835518 -0.0696424 0.4598468 1.8077597 -0.3615906 -0.1049658 -0.3561817 0.141156 1.7004894 -0.2838414 0.0704899 -0.4600105 1.8068024 -0.3614042 0.1056454 -0.3557979 0.1410771 0.0783542 -0.041256 0.0944558 0.0252133 0.0007921 0.0339556 0.0443474 0.0295734 0.0013407 -0.1202461 -0.0151021 -0.0971594 -0.0248664 0.025476 -0.0822726 -0.0865654 -0.0516025 0.0209227 0.0786816 0.0415999 -0.0944033 -0.0247758 0.0008633 0.0337575 -0.0444474 0.029427 0.0018758 -0.1202043 0.014533 0.0974379 0.0241946 0.0255711 -0.0823491 0.0869364 -0.0516095 0.0204776 0.0364596 -0.0594445 0.0852357 -0.1074427 0.008102 0.1057109 0.0763353 0.0553688 -0.0266772 -0.0400137 -0.0726396 -0.0945899 -0.050115 0.0819414 -0.0292881 -0.0607112 -0.0225343 0.0448796 -0.0038074 0.12754 -0.0156458 0.1717549 -0.0846574 0.0199422 -0.0023814 0.0375958 0.069259 0.0360668 0.0597681 -0.085312 0.1077653 0.008051 0.1055837 -0.0762988 0.0553276 -0.0261881 -0.0401059 0.0723786 0.0948544 0.0498048 0.082061 -0.0292719 0.0608286 -0.0226437 0.0444585 -0.0034843 -0.1273972 0.0155203 -0.1716217 -0.0850468 0.0198872 0.0021477 0.0375411 0.0692684 unknown
polarizability: 168.0599707|0.0145479|147.9993653|0.0276637|-9.7401384|71.2392944 unknown
InChI: InChI=1S/C7H10Cl2N4/c1-3-13(4-2)7-11-5(8)10-6(9)12-7/h3-4H2,1-2H3
charge 0 multiplicity 1
23 atoms
Cl 2.679161 2.6368 -0.536548
Cl 2.683128 -2.632313 0.535103
N  -1.594221 -0.0010 -0.001227
N  0.431632 -1.198685 0.233099
N  0.429825 1.199808 -0.234464
N  2.525197 0.00217 -0.000508
C  -2.354429 1.247729 -0.268408
C  -2.352933 -1.250747 0.265255
C  -0.235378 0.000061 -0.000621
C  -2.635766 2.048797 1.019015
C  -2.635539 -2.050129 -1.022949
C  1.764279 1.107849 -0.223149
C  1.76594 -1.104679 0.222055
H  -1.77178 1.863943 -0.971566
H  -3.298766 0.953916 -0.761923
H  -1.768509 -1.867426 0.966502
H  -3.296766 -0.958595 0.76076
H  -3.190928 1.445268 1.75977
H  -1.6890 2.384258 1.474809
H  -3.240433 2.942884 0.782728
H  -3.192426 -1.446066 -1.761978
H  -1.689189 -2.384008 -1.480787
H  -3.239001 -2.945134 -0.787067
