program: Orca
programVersion: 5.0.2
elementType: Cl Cl O O O N C C C C C C C C C C C C C C C C C C C C C C H H H H H H H H H H H H H H H H H H H
charge: 0
multiplicity: 1
keywords: wb97x-d3
keywords: def2-TZVPP
keywords: def2/J RIJCOSX
keywords: DEFGRID2
keywords: scfconv7
keywords: smallprint printgap noloewdin
keywords: NOSOSCF
formula: C22H19Cl2NO3
InChI: InChI=1/C22H19Cl2NO3/c1-22(2)17(12-19(23)24)20(22)21(26)28-18(13-25)14-7-6-10-16(11-14)27-15-8-4-3-5-9-15/h3-12,17-18,20H,1-2H3
47 atoms
Cl -1.062896 -0.517536 -2.430597
Cl -3.061425 -1.821376 -4.06357
O  1.447425 -1.994684 0.301362
O  -0.028422 -0.890918 1.567447
O  1.421893 3.763614 0.507448
N  4.736946 -2.11682 0.012268
C  -1.967824 -3.26495 0.858526
C  -2.160583 -2.1504 -0.106131
C  -0.758383 -2.678643 0.147258
C  -2.205557 -3.005615 2.325194
C  -2.331068 -4.665564 0.429196
C  -2.762452 -2.333297 -1.44451
C  0.208004 -1.763791 0.771706
C  -2.356218 -1.649592 -2.505356
C  2.443439 -1.031998 0.632124
C  2.223952 0.251591 -0.132738
C  3.718397 -1.656477 0.275163
C  1.975218 1.418786 0.571581
C  2.196026 0.240036 -1.522764
C  1.667077 2.581225 -0.123718
C  1.908818 1.413031 -2.20288
C  1.631208 2.582556 -1.510812
C  0.804322 3.773271 1.73106
C  -0.323908 3.004108 1.991335
C  1.316989 4.630071 2.693402
C  -0.931554 3.0962 3.234779
C  0.690992 4.720421 3.928838
C  -0.429901 3.951227 4.207382
H  -2.352651 -1.178315 0.341818
H  -0.341437 -3.30506 -0.632683
H  -3.232033 -3.276823 2.579239
H  -2.06652 -1.964171 2.606012
H  -1.543019 -3.614602 2.942651
H  -3.398197 -4.845782 0.572691
H  -1.788749 -5.400393 1.026386
H  -2.097816 -4.858198 -0.618543
H  -3.582356 -3.031694 -1.567073
H  2.467897 -0.837402 1.709027
H  2.009092 1.410164 1.653884
H  2.391309 -0.671138 -2.074801
H  1.883687 1.416809 -3.284552
H  1.38799 3.49345 -2.043301
H  -0.729296 2.339744 1.238011
H  2.195631 5.223861 2.474543
H  -1.808864 2.496254 3.439137
H  1.090126 5.391536 4.678383
H  -0.911724 4.018363 5.173878
elementType: Cl O N C H
totalener: -2050.68343652 hartree
nucrepener: 2873.32935464 hartree
electener: -4924.01279116 hartree
oneelecener: -8522.43539694 hartree
twoeener: 3598.42260578 hartree
cpcmener: -0.02958134 hartree
kineticenergy: 2044.48765678 hartree
xcener: -151.866469530323 hartree
chargesum: -0.0000000
charge: -0.050219 -0.054969 -0.273146 -0.446502 -0.328399 -0.087637 0.146153 -0.050404 -0.106635 -0.272791 -0.281550 -0.220777 0.370308 0.084344 0.413284 0.064650 -0.227272 -0.191535 -0.297029 0.280052 -0.126383 -0.212421 0.280457 -0.185527 -0.242635 -0.143554 -0.124371 -0.180717 0.120635 0.109444 0.095151 0.094922 0.100636 0.102523 0.099458 0.093626 0.140103 0.134690 0.143754 0.148759 0.162653 0.148838 0.149790 0.145985 0.158959 0.157593 0.157707
qa: -0.0502 -0.0550 -0.2731 -0.4465 -0.3284 -0.0876 0.1462 -0.0504 -0.1066 -0.2728 -0.2815 -0.2208 0.3703 0.0843 0.4133 0.0646 -0.2273 -0.1915 -0.2970 0.2801 -0.1264 -0.2124 0.2805 -0.1855 -0.2426 -0.1436 -0.1244 -0.1807 0.1206 0.1094 0.0952 0.0949 0.1006 0.1025 0.0995 0.0936 0.1401 0.1347 0.1438 0.1488 0.1627 0.1488 0.1498 0.1460 0.1590 0.1576 0.1577
va: 1.2983 1.2522 2.1290 2.0559 2.0845 3.1124 3.7129 3.8874 3.8355 3.8885 3.9140 3.9142 4.1721 4.1850 3.7390 3.5092 4.0685 3.9344 3.9440 3.7389 3.8383 4.0048 3.6894 3.9069 4.0099 3.8925 3.8837 3.9054 1.0178 1.0258 1.0013 1.0180 0.9992 0.9990 1.0031 0.9990 1.0079 1.0179 1.0097 1.0141 0.9887 1.0037 1.0062 1.0076 0.9904 0.9892 0.9904
dispcorr: -0.026870920 hartree
energy: -2050.710307437093
dipole: -4.53633 2.39895 -2.13737 -3.01885 2.48861 -0.53023 27.73608 -26.98311 0.75297
magnitude: 2.32733 au
magnitude: 5.91561 debye
