program: Gaussian 09
title: 000074403
version: EM64L-G09RevD.01
frameworkgroup: C1[X(C5H5ClN2O)]
method: RPBEPBE
basis: SDD
operation: Freq
keyword: #p
keyword: freq=noraman
keyword: PBEPBE/SDD
title: #p freq=noraman PBEPBE/SDD
converged: NO NO NO NO
title: Mulliken charges:
elementType: Cl O N N C C C C C H H H H H
charge: -0.006067 -0.267575 -0.122992 -0.010764 0.210739 -0.260836 -0.090101 -0.223482 -0.501277 0.271585 0.271686 0.247883 0.247886 0.233315
chargesum: 0.00000
title: Mulliken charges with hydrogens summed into heavy atoms:
elementType: Cl O N N C C C C C
charge: -0.006067 -0.267575 -0.122992 -0.010764 0.210739 0.010749 0.181585 -0.223482 0.227807
polarizability: 1.29855769e+02 5.99007439e-01 7.23453779e+01 -1.58548744e-03 5.00114824e-04 3.66042615e+01
1716.lowfreq: -5.5741 -0.0034 -0.0012 0.0009 6.1762 15.1885 83.5442 136.6713 163.4587
frequency: 83.5366 136.6653 163.4574 181.6828 292.0511 312.7456 357.8674 401.0524 488.2841 510.3591 601.2140 632.0068 730.2040 775.4899 828.5498 946.4905 962.4043 963.4691 1043.4099 1112.8573 1116.5467 1145.3592 1153.7794 1256.9289 1304.2422 1350.0054 1438.6598 1446.6118 1462.4414 1502.7339 1562.7861 3007.6384 3111.4243 3152.4044 3172.3649 3192.3240
redmass: 6.0641 1.6452 1.7467 4.4687 6.0181 5.1005 13.1214 6.7888 4.5675 3.9141 8.3018 8.1859 6.2201 8.1059 1.5288 9.8368 1.3227 4.5867 3.3237 1.2527 1.8335 1.5008 3.1322 3.2462 3.5744 2.7339 1.3209 1.0502 1.0551 5.2810 6.3772 1.0289 1.1047 1.1058 1.0901 1.1005
irintensity: 3.3704 7.6408 4.5587 5.9949 10.4947 1.8662 1.2636 0.1078 3.0073 0.0019 1.3427 48.4750 0.0500 3.1972 48.7098 72.2493 0.0500 2.3314 18.6767 0.1065 71.5629 0.3194 5.3856 93.1090 3.2101 339.6954 53.2411 14.8383 30.6632 24.7560 30.8505 38.0623 22.9596 21.2572 0.4635 1.2422
temp: 298.150 k
press: 1.00000 atm
elementType: 17 8 7 7 6 6 6 6 6 1 1 1 1 1
symmnumber: 1
zpe: 250617.9 jmol-1
zpe.correction: 0.095455 hartree
zpe.thermalcorrener: 0.103746 hartree
zpe.thermalcorrenthalpy: 0.104691 hartree
zpe.thermalcorrgfe: 0.061792 hartree
zpe.sumelectzpe: -837.597437 hartree
zpe.sumelectthermal: -837.589146 hartree
zpe.sumelectthermalent: -837.588202 hartree
zpe.sumelectthermalfe: -837.631100 hartree
dipole: -2.3357 3.1137 0.0001
dipole: 3.8923
quadrupole: -53.8419 -58.7340 -59.2591
quadrupole: 6.5979 0.0001 -0.0001
quadrupole: 3.4364 -1.4557 -1.9807 6.5979 0.0001 -0.0001
hfenergy: -837.692892 hartree
pointgroup: C01[X(C5H5Cl1N2O1)]
dipole: 0.9028799 1.2368871 -0.0000249 debye
dipolederiv: -0.8884394 -0.0695712 0.0000161 -0.1103425 -0.1059392 0.0000028 0.0000176 0.0000022 -0.0596144 -1.7221475 0.2170512 0.0000167 0.0471681 -0.3815307 0.0000018 -0.0000061 0.0000033 -0.308345 -0.4572858 0.2452072 -0.0000006 -0.6772401 -0.0794541 0.0000045 0.0000121 -0.0000082 -0.2212264 -0.3445506 -0.2882887 0.0000059 0.4367303 -0.1124857 -0.0000094 -0.0000033 0.0000031 -0.178981 1.6721804 -0.0812761 -0.0000145 0.4215303 -0.0356615 0.0000008 -0.0000101 0.0000066 0.2394027 -0.2933556 -0.0022647 0.0000008 0.1977069 0.0797036 -0.0000048 -0.0000021 -0.0000019 -0.0918514 -0.1629599 -0.0347355 0.0000019 -0.0928083 0.0768026 0.0000016 0.0000041 -0.0000008 -0.0405371 1.4084792 0.2252122 -0.0000282 0.0167714 0.0556232 -0.0000007 -0.0000258 -0.0000034 0.0568169 0.6873009 -0.1626643 -0.0000034 -0.3820416 0.3866421 0.0000074 0.0000095 0.0000039 0.2674736 0.0821514 -0.0537781 0.0000026 -0.0449384 0.0031088 0.0000029 0.0000019 0.0000023 0.1580404 0.0558074 0.0708451 0.000001 0.0645364 0.032553 0.0000003 0.0000016 0.0000003 0.1545814 0.0516434 -0.0189018 -0.0593968 0.1078571 0.0080278 -0.0750014 -0.0123063 -0.088747 -0.0505921 0.0516455 -0.0189103 0.0594057 0.107847 0.0080277 0.0749998 0.0123149 0.0887431 -0.0505766 -0.1404694 -0.027925 -0.0000072 -0.0927763 0.0645822 -0.0000055 -0.000008 -0.0000036 0.1254089 unknown
polarizability: 129.8616095|0.1512794|72.3395374|-0.0015788|-0.0005208|36.6042615 unknown
InChI: InChI=1S/C5H5ClN2O/c1-9-5-3-2-4(6)7-8-5/h2-3H,1H3
charge 0 multiplicity 1
14 atoms
Cl -3.468614 -0.423138 0.000052
O  2.338116 0.465242 -0.000053
N  0.486889 -0.996194 -0.000014
N  -0.881695 -1.188935 0.000015
C  0.975387 0.280563 -0.000047
C  0.153473 1.446665 -0.000045
C  -1.22839 1.244986 -0.000015
C  -1.679905 -0.103401 0.000013
C  3.182493 -0.756663 -0.000034
H  0.605236 2.441185 -0.000066
H  -1.93654 2.076738 -0.000011
H  2.977216 -1.363947 -0.897109
H  2.977149 -1.363974 0.897007
H  4.210684 -0.369227 0.000008
