program: Orca
programVersion: 5.0.2
elementType: Cl Cl O O O N C C C C C C C C C C C C C C C C C C C C C C H H H H H H H H H H H H H H H H H H H
charge: 0
multiplicity: 1
keywords: wb97x-d3
keywords: def2-TZVPP
keywords: def2/J RIJCOSX
keywords: DEFGRID2
keywords: scfconv7
keywords: smallprint printgap noloewdin
keywords: NOSOSCF
formula: C22H19Cl2NO3
InChI: InChI=1/C22H19Cl2NO3/c1-22(2)17(12-19(23)24)20(22)21(26)28-18(13-25)14-7-6-10-16(11-14)27-15-8-4-3-5-9-15/h3-12,17-18,20H,1-2H3
47 atoms
Cl -2.914834 -2.518906 -3.229644
Cl -4.060185 -5.0186 -2.355656
O  1.170271 -1.538944 -0.427143
O  1.684539 -2.52769 1.508685
O  1.351975 3.666114 0.16449
N  2.937523 -0.589403 -3.048525
C  -1.68527 -1.807861 0.945087
C  -1.537759 -2.481142 -0.394933
C  -0.523072 -2.74603 0.693151
C  -1.450422 -0.318496 1.008495
C  -2.738815 -2.283489 1.915076
C  -2.424007 -3.581245 -0.798903
C  0.876085 -2.27245 0.653561
C  -3.042131 -3.683653 -1.96838
C  2.487466 -0.99892 -0.508021
C  2.62495 0.281743 0.277942
C  2.720171 -0.771023 -1.935603
C  1.90511 1.408612 -0.10267
C  3.447484 0.317733 1.394576
C  2.029366 2.579299 0.629152
C  3.560493 1.495851 2.119001
C  2.860988 2.63094 1.743663
C  0.894179 4.613817 1.043006
C  0.146795 4.264973 2.161124
C  1.153706 5.94318 0.747036
C  -0.333782 5.266137 2.992025
C  0.658112 6.935249 1.582398
C  -0.080302 6.602273 2.709101
H  -1.216367 -1.825069 -1.195004
H  -0.599873 -3.700291 1.203917
H  -2.399921 0.209596 0.905569
H  -0.792445 0.048182 0.222795
H  -1.018644 -0.034563 1.970472
H  -3.712558 -1.863006 1.656146
H  -2.495929 -1.955007 2.927168
H  -2.839419 -3.367769 1.941466
H  -2.591799 -4.382991 -0.089428
H  3.230293 -1.728399 -0.171252
H  1.257233 1.392727 -0.972267
H  4.002154 -0.561858 1.694133
H  4.207081 1.534945 2.98555
H  2.975167 3.54601 2.310619
H  -0.063678 3.225584 2.382447
H  1.734697 6.198879 -0.130348
H  -0.915666 4.996437 3.863915
H  0.859043 7.97343 1.35129
H  -0.459881 7.378147 3.360786
elementType: Cl O N C H
totalener: -2050.68450850 hartree
nucrepener: 2732.96884765 hartree
electener: -4783.65335615 hartree
oneelecener: -8241.04133657 hartree
twoeener: 3457.38798042 hartree
cpcmener: -0.03206803 hartree
kineticenergy: 2044.46345295 hartree
xcener: -151.861561547185 hartree
chargesum: 0.0000000
charge: -0.055796 -0.059654 -0.267551 -0.436290 -0.324522 -0.086807 0.093691 0.060410 -0.111888 -0.278498 -0.265034 -0.224628 0.407844 0.041488 0.376415 0.049007 -0.223201 -0.305639 -0.176970 0.267006 -0.141591 -0.169061 0.248799 -0.171172 -0.225434 -0.154623 -0.131262 -0.171222 0.086431 0.103197 0.102081 0.091033 0.107941 0.101122 0.099076 0.090464 0.131553 0.139501 0.137521 0.145938 0.160379 0.157021 0.160897 0.146760 0.159159 0.157190 0.158918
qa: -0.0558 -0.0597 -0.2676 -0.4363 -0.3245 -0.0868 0.0937 0.0604 -0.1119 -0.2785 -0.2650 -0.2246 0.4078 0.0415 0.3764 0.0490 -0.2232 -0.3056 -0.1770 0.2670 -0.1416 -0.1691 0.2488 -0.1712 -0.2254 -0.1546 -0.1313 -0.1712 0.0864 0.1032 0.1021 0.0910 0.1079 0.1011 0.0991 0.0905 0.1316 0.1395 0.1375 0.1459 0.1604 0.1570 0.1609 0.1468 0.1592 0.1572 0.1589
va: 1.2698 1.2457 2.1383 2.0716 2.0774 3.1101 3.7435 3.8257 3.8717 3.9083 3.9010 3.8823 4.2012 4.2116 3.7617 3.5746 4.0668 4.0420 3.9673 3.7821 3.9252 3.9081 3.7149 3.9018 4.0023 3.8998 3.8897 3.8939 1.0378 1.0285 1.0018 1.0078 0.9990 1.0009 1.0014 1.0053 1.0170 1.0161 1.0221 1.0092 0.9909 0.9957 0.9939 1.0067 0.9908 0.9896 0.9899
dispcorr: -0.024812536 hartree
energy: -2050.709321032424
dipole: 8.68691 -9.21537 -0.52847 26.41699 -25.64796 0.76903 31.77778 -28.98393 2.79385
magnitude: 2.94555 au
magnitude: 7.48699 debye
