program: Orca
programVersion: 5.0.2
elementType: Cl Cl O O O N C C C C C C C C C C C C C C C C C C C C C C H H H H H H H H H H H H H H H H H H H
charge: 0
multiplicity: 1
keywords: wb97x-d3
keywords: def2-TZVPP
keywords: def2/J RIJCOSX
keywords: DEFGRID2
keywords: scfconv7
keywords: smallprint printgap noloewdin
keywords: NOSOSCF
formula: C22H19Cl2NO3
InChI: InChI=1/C22H19Cl2NO3/c1-22(2)17(12-19(23)24)20(22)21(26)28-18(13-25)14-7-6-10-16(11-14)27-15-8-4-3-5-9-15/h3-12,17-18,20H,1-2H3
47 atoms
Cl -1.72601 -5.3377 1.076659
Cl -4.374822 -5.675748 -0.012816
O  0.0906 -0.818295 0.178216
O  -1.354139 0.750027 -0.476899
O  2.080641 4.622321 -0.655615
N  2.318924 -1.227689 2.554811
C  -0.974869 -2.406527 -2.239905
C  -1.507277 -2.929684 -0.937282
C  -1.653624 -1.455397 -1.274025
C  0.521982 -2.391842 -2.434352
C  -1.726369 -2.67621 -3.521869
C  -2.723965 -3.746153 -0.859519
C  -0.980164 -0.39465 -0.504182
C  -2.905337 -4.777638 -0.044692
C  0.802316 0.152552 0.935505
C  1.646285 1.060461 0.072797
C  1.647702 -0.633059 1.83749
C  1.455547 2.432045 0.145571
C  2.590206 0.5183 -0.79178
C  2.237349 3.269152 -0.642141
C  3.346354 1.364772 -1.586209
C  3.181188 2.739355 -1.511106
C  1.720725 5.294288 0.482744
C  2.321212 5.0380 1.709301
C  0.769695 6.295801 0.353294
C  1.950216 5.791418 2.813588
C  0.418156 7.049951 1.463953
C  0.999983 6.797534 2.698295
H  -0.745801 -3.162113 -0.202535
H  -2.641574 -1.137549 -1.587752
H  1.081196 -2.367192 -1.50243
H  0.828629 -1.537449 -3.04063
H  0.824076 -3.296002 -2.966218
H  -1.514734 -3.683694 -3.88481
H  -1.411664 -1.973352 -4.295143
H  -2.80605 -2.577753 -3.416488
H  -3.550803 -3.488513 -1.510509
H  0.119354 0.741639 1.55603
H  0.700526 2.836835 0.808569
H  2.741808 -0.552715 -0.846444
H  4.083419 0.953457 -2.263022
H  3.779515 3.4009 -2.124812
H  3.072402 4.264203 1.808677
H  0.31512 6.486718 -0.61084
H  2.415056 5.591168 3.770305
H  -0.321406 7.833487 1.360678
H  0.718847 7.382913 3.56377
elementType: Cl O N C H
totalener: -2050.68422794 hartree
nucrepener: 2706.75859749 hartree
electener: -4757.44282543 hartree
oneelecener: -8188.76414159 hartree
twoeener: 3431.32131617 hartree
cpcmener: -0.03247109 hartree
kineticenergy: 2044.48116680 hartree
xcener: -151.866048657093 hartree
chargesum: -0.0000000
charge: -0.055124 -0.059599 -0.267199 -0.437602 -0.326299 -0.085582 0.102023 0.053123 -0.103994 -0.278818 -0.270724 -0.223610 0.411710 0.046410 0.350165 0.044039 -0.221831 -0.171126 -0.244172 0.265344 -0.133577 -0.223223 0.278288 -0.191189 -0.245564 -0.142960 -0.120445 -0.183592 0.087782 0.097605 0.089137 0.104640 0.101972 0.101443 0.099402 0.092088 0.129301 0.142205 0.143910 0.159409 0.158368 0.147476 0.157249 0.146791 0.160071 0.157761 0.158517
qa: -0.0551 -0.0596 -0.2672 -0.4376 -0.3263 -0.0856 0.1020 0.0531 -0.1040 -0.2788 -0.2707 -0.2236 0.4117 0.0464 0.3502 0.0440 -0.2218 -0.1711 -0.2442 0.2653 -0.1336 -0.2232 0.2783 -0.1912 -0.2456 -0.1430 -0.1204 -0.1836 0.0878 0.0976 0.0891 0.1046 0.1020 0.1014 0.0994 0.0921 0.1293 0.1422 0.1439 0.1594 0.1584 0.1475 0.1572 0.1468 0.1601 0.1578 0.1585
va: 1.2705 1.2456 2.1317 2.0764 2.0834 3.1094 3.7060 3.8386 3.8680 3.9113 3.9137 3.8983 4.1968 4.2162 3.8017 3.5479 4.0657 3.9315 3.9743 3.7504 3.9433 4.0138 3.6973 3.9178 4.0109 3.8906 3.8822 3.9064 1.0363 1.0292 1.0120 0.9981 1.0017 1.0007 1.0005 1.0057 1.0202 1.0159 1.0105 0.9929 0.9906 1.0054 0.9964 1.0077 0.9900 0.9893 0.9904
dispcorr: -0.024375322 hartree
energy: -2050.708603258271
dipole: 15.61570 -15.83236 -0.21667 29.65770 -28.93664 0.72106 -15.73899 14.17812 -1.56087
magnitude: 1.73297 au
magnitude: 4.40486 debye
