program: Gaussian 09
title: 000074401
version: EM64L-G09RevD.01
frameworkgroup: C1[X(C9H11NO2)]
method: RPBEPBE
basis: SDD
operation: Freq
keyword: #p
keyword: freq=noraman
keyword: PBEPBE/SDD
title: #p freq=noraman PBEPBE/SDD
converged: YES YES NO NO
title: Mulliken charges:
elementType: O O N C C C C C C C C C H H H H H H H H H H H
charge: -0.294850 -0.247647 -0.039803 0.088954 0.088122 -0.246584 0.184594 -0.220890 -0.735833 -0.177001 -0.349396 -0.673746 0.284396 0.230259 0.230306 0.242369 0.242465 0.241945 0.234276 0.214356 0.229479 0.229457 0.244772
chargesum: 0.00000
title: Mulliken charges with hydrogens summed into heavy atoms:
elementType: O O N C C C C C C C C C
charge: -0.294850 -0.247647 -0.039803 0.088954 0.088122 0.037812 0.184594 0.239675 -0.009053 0.057275 -0.104624 -0.000454
polarizability: 1.48212459e+02 6.24638725e+00 1.24176500e+02 -3.03280491e-02 1.64069656e-02 5.88794670e+01
1716.lowfreq: -22.0698 -4.2520 -0.0008 -0.0007 -0.0007 8.8429 13.1545 55.6016 88.4820
frequency: -10.5974 55.2287 88.4765 109.1734 137.8240 169.2304 228.6851 250.2972 258.2403 295.3141 369.0544 389.7580 434.2342 480.6907 481.6001 561.5240 654.4456 699.0439 749.4201 769.9462 796.7813 811.5323 829.2297 867.0300 955.4083 963.3432 998.0736 1012.6444 1039.3750 1044.3411 1063.4868 1111.5693 1133.5663 1136.2497 1210.4120 1235.7575 1249.1196 1264.4571 1305.8487 1356.7039 1397.7647 1398.0173 1414.4455 1430.9208 1452.7477 1455.0728 1463.6390 1473.3597 1486.5659 1542.7187 1579.9401 1616.2003 2995.0124 2999.3600 3008.4007 3066.3613 3077.4914 3092.1839 3106.3409 3125.7406 3127.9135 3160.2241 3185.0361
redmass: 2.7234 4.6907 3.0014 3.7169 2.8488 1.0507 1.9440 3.9190 1.7277 4.8417 5.4866 3.4258 4.5079 4.2024 2.8321 6.3289 7.0964 6.7790 2.0464 6.9061 1.0993 3.9498 1.7565 4.7686 1.4045 2.0312 1.3856 2.4814 4.1353 1.6130 2.3282 2.2265 1.5058 1.4706 2.6202 2.4553 1.1313 2.1274 6.5449 1.3858 1.2457 1.2464 1.6351 3.1041 1.2137 1.0472 1.0407 1.0589 1.0690 6.1399 6.0557 10.7649 1.0356 1.0369 1.0580 1.1066 1.0953 1.0986 1.1026 1.1014 1.0894 1.0931 1.0974
irintensity: 0.0191 0.6087 0.0934 0.9612 9.2383 0.3122 0.9070 2.3131 0.1428 4.6021 8.5168 6.5612 1.3387 4.8234 8.4825 0.3634 2.2333 5.3994 33.9439 1.1390 2.1638 3.6627 23.3975 2.3276 0.4440 14.1906 0.2254 31.0034 302.9497 7.9080 9.6616 3.4332 70.6412 5.6045 123.1622 121.4874 0.0154 46.2084 13.1678 2.0345 9.0384 41.1833 2.2089 51.3576 27.2871 14.7348 12.6148 5.7011 11.5217 46.1264 22.3271 213.4531 20.9645 5.3699 19.1970 7.8298 9.6572 30.1487 44.8318 17.0600 15.1290 17.9776 8.4927
temp: 298.150 k
press: 1.00000 atm
elementType: 8 8 7 6 6 6 6 6 6 6 6 6 1 1 1 1 1 1 1 1 1 1 1
symmnumber: 1
zpe: 479837.5 jmol-1
zpe.correction: 0.182760 hartree
zpe.thermalcorrener: 0.193843 hartree
zpe.thermalcorrenthalpy: 0.194787 hartree
zpe.thermalcorrgfe: 0.145498 hartree
zpe.sumelectzpe: -553.868598 hartree
zpe.sumelectthermal: -553.857516 hartree
zpe.sumelectthermalent: -553.856572 hartree
zpe.sumelectthermalfe: -553.905861 hartree
dipole: 2.3607 -2.7028 0.0019
dipole: 3.5886
quadrupole: -65.4731 -68.7512 -71.4363
quadrupole: 2.6242 -0.0024 0.0110
quadrupole: 3.0804 -0.1977 -2.8827 2.6242 -0.0024 0.0110
hfenergy: -554.0513586 hartree
pointgroup: C01 [X(C9H11N1O2)]
dipole: 0.8639723 -1.116494 0.018035 debye
dipolederiv: -1.7185845 0.3386065 0.0117274 0.5853788 -0.6445321 0.0014319 0.0044436 0.0050831 -0.282732 -0.7327762 -0.1917432 0.0118266 0.044562 -0.9168346 0.0165417 0.004601 0.0199804 -0.2966271 -0.3651457 -0.225622 0.0075174 -0.0529472 -0.5961594 0.0099586 0.0032485 0.0127274 -0.2498668 -0.617786 0.0179155 0.0092376 -0.2054995 -0.3933922 0.0138501 0.0153639 0.0102421 0.0071804 0.2175631 0.1026297 -0.0053101 -0.1239107 0.7166936 -0.0153649 0.0004022 -0.0180041 0.0480394 0.188598 -0.0033874 -0.0043081 0.2233693 0.1194671 -0.008788 -0.0107374 -0.0054243 -0.0848404 1.9960874 0.0058502 -0.0261999 -0.448657 1.2622073 -0.0223497 -0.0132341 -0.0287581 0.2218162 1.0304732 -0.1147228 -0.0068653 0.0122362 0.2441438 0.0027804 -0.0100164 0.0045673 0.3527573 0.0942249 -0.1438771 0.0028205 0.0068847 -0.3438006 0.0089792 -0.0005753 0.0096082 0.0138844 -0.4629019 -0.0058985 0.0052667 0.12024 0.0520274 -0.0067896 0.0020416 -0.0048237 -0.1305681 0.4150889 0.1181328 -0.010451 -0.0836354 0.2670021 -0.0071636 -0.0052884 -0.0103782 -0.0469443 -0.0889139 0.0930973 -0.0003854 0.0701118 -0.030387 0.0017151 0.00021 0.0013757 0.0635842 0.0726009 0.0788192 -0.0008863 0.0875112 0.0660748 0.0006632 -0.0010953 0.0008498 0.1423217 -0.0664289 0.0343426 -0.009434 -0.0493693 0.0072229 0.0919095 0.0353363 0.0923977 -0.0644325 -0.0669753 0.0320715 0.0078761 -0.0539949 -0.003397 -0.0938088 -0.0321348 -0.0966849 -0.0528196 0.0725888 -0.0159677 0.0904174 -0.0047533 0.0572794 0.0251617 0.0780813 0.0521247 -0.0215177 -0.0910759 0.1382231 -0.0014765 0.0280148 0.0768413 0.0007394 0.0016155 -0.0004411 0.113414 0.0681747 -0.0218011 -0.091525 -0.0093605 0.0523211 -0.0289213 -0.0800484 -0.0552422 -0.014396 0.0799631 -0.0199706 0.0018217 -0.0536529 -0.1085632 0.0080514 0.0028467 0.0075111 0.1621867 -0.1738345 -0.0354397 0.0052048 -0.0571707 0.0642769 0.0022743 0.0057966 0.0019559 0.1162074 0.1186897 -0.0352217 0.0508426 0.0240305 0.0118227 0.0935236 0.0218689 0.1082521 -0.0706055 0.1164336 -0.0413529 -0.0539418 0.019873 0.0001866 -0.0980886 -0.0283139 -0.1111159 -0.0567348 -0.0860636 -0.1046838 0.0062245 -0.0792613 0.0394989 0.0036944 0.0055877 0.0041971 0.130693 unknown
polarizability: 148.8471691|4.7404993|123.4716799|-1.4867848|-1.7904029|58.9495773 unknown
InChI: InChI=1S/C9H11NO2/c1-3-12-9(11)8-5-4-6-10-7(8)2/h4-6H,3H2,1-2H3
charge 0 multiplicity 1
23 atoms
O  1.949574 -0.410347 -0.100102
O  1.272289 1.814303 -0.151691
N  -2.832534 0.315326 -0.048114
C  -0.406677 0.018326 -0.078039
C  -1.571249 0.859438 -0.082427
C  -0.580631 -1.391678 -0.037896
C  0.970678 0.594491 -0.113622
C  3.365448 0.062851 -0.134034
C  -1.52412 2.369517 -0.122466
C  -1.877839 -1.935229 -0.002905
C  -2.971101 -1.039981 -0.009661
C  4.246344 -1.182292 -0.111391
H  0.304784 -2.032022 -0.034887
H  3.508262 0.667756 -1.047896
H  3.534281 0.718943 0.739144
H  -0.987601 2.734374 -1.015829
H  -2.557673 2.747594 -0.120755
H  -0.969859 2.779567 0.74029
H  -2.042505 -3.016391 0.028578
H  5.310807 -0.885642 -0.134961
H  4.071504 -1.773194 0.80399
H  4.045799 -1.823832 -0.98649
H  -4.003082 -1.409775 0.016665
