program: Orca
programVersion: 5.0.2
elementType: Cl Cl O O O N C C C C C C C C C C C C C C C C C C C C C C H H H H H H H H H H H H H H H H H H H
charge: 0
multiplicity: 1
keywords: wb97x-d3
keywords: def2-TZVPP
keywords: def2/J RIJCOSX
keywords: DEFGRID2
keywords: scfconv7
keywords: smallprint printgap noloewdin
keywords: NOSOSCF
formula: C22H19Cl2NO3
InChI: InChI=1/C22H19Cl2NO3/c1-22(2)17(12-19(23)24)20(22)21(26)28-18(13-25)14-7-6-10-16(11-14)27-15-8-4-3-5-9-15/h3-12,17-18,20H,1-2H3
47 atoms
Cl -2.903263 0.435248 1.368972
Cl -4.297579 0.304301 -1.151283
O  1.869285 -2.368523 -0.79555
O  1.33047 -2.322438 1.373222
O  0.854707 2.487087 -1.080748
N  4.593797 -2.138524 -2.625698
C  -1.332916 -3.719009 0.454723
C  -1.526227 -2.233708 0.425042
C  -0.326931 -2.863749 -0.280304
C  -0.992907 -4.359401 1.778099
C  -2.19025 -4.60229 -0.420186
C  -2.534421 -1.565693 -0.404273
C  1.006644 -2.509859 0.229894
C  -3.152424 -0.432157 -0.095043
C  3.122024 -1.778776 -0.496957
C  3.005198 -0.295468 -0.209548
C  3.937329 -1.993198 -1.694861
C  1.963337 0.441482 -0.757346
C  3.952673 0.321768 0.593569
C  1.874924 1.797096 -0.487466
C  3.862155 1.685261 0.837142
C  2.825329 2.432507 0.301157
C  -0.047097 3.186784 -0.330598
C  -0.207463 3.02028 1.038815
C  -0.856973 4.073315 -1.032401
C  -1.174902 3.764519 1.702175
C  -1.82386 4.799488 -0.35675
C  -1.985095 4.655641 1.015518
H  -1.276679 -1.733275 1.353734
H  -0.39064 -2.910244 -1.361304
H  -0.483577 -3.68886 2.465822
H  -0.362516 -5.238224 1.631315
H  -1.911413 -4.691668 2.265053
H  -3.163686 -4.769434 0.044228
H  -1.713809 -5.575129 -0.552182
H  -2.360151 -4.189465 -1.414084
H  -2.780629 -2.009067 -1.361616
H  3.619072 -2.285911 0.33702
H  1.215059 -0.016306 -1.392464
H  4.758792 -0.256442 1.028068
H  4.603765 2.170698 1.457475
H  2.758233 3.495353 0.497131
H  0.397703 2.317589 1.596267
H  -0.728077 4.187161 -2.101596
H  -1.296781 3.631716 2.769477
H  -2.451504 5.486928 -0.909216
H  -2.737555 5.228349 1.541183
elementType: Cl O N C H
totalener: -2050.68429126 hartree
nucrepener: 2877.98365325 hartree
electener: -4928.66794451 hartree
oneelecener: -8531.74682707 hartree
twoeener: 3603.07888256 hartree
cpcmener: -0.03240962 hartree
kineticenergy: 2044.47085946 hartree
xcener: -151.864739245649 hartree
chargesum: -0.0000000
charge: -0.056876 -0.060942 -0.287543 -0.433548 -0.325333 -0.085648 0.094980 0.032099 -0.059558 -0.265469 -0.267690 -0.212417 0.353655 0.059235 0.405539 0.014949 -0.229788 -0.184449 -0.198969 0.209761 -0.117077 -0.180887 0.338853 -0.215681 -0.264326 -0.170926 -0.117933 -0.184931 0.086132 0.098086 0.094997 0.099664 0.096667 0.102759 0.099115 0.091483 0.129211 0.145852 0.136193 0.146254 0.161458 0.160031 0.149631 0.143405 0.156809 0.156276 0.156896
qa: -0.0569 -0.0609 -0.2875 -0.4335 -0.3253 -0.0856 0.0950 0.0321 -0.0596 -0.2655 -0.2677 -0.2124 0.3537 0.0592 0.4055 0.0149 -0.2298 -0.1844 -0.1990 0.2098 -0.1171 -0.1809 0.3389 -0.2157 -0.2643 -0.1709 -0.1179 -0.1849 0.0861 0.0981 0.0950 0.0997 0.0967 0.1028 0.0991 0.0915 0.1292 0.1459 0.1362 0.1463 0.1615 0.1600 0.1496 0.1434 0.1568 0.1563 0.1569
va: 1.2683 1.2435 2.1063 2.0723 2.0752 3.1131 3.7659 3.8703 3.8142 3.8968 3.9089 3.9180 4.2011 4.1900 3.7155 3.6498 4.0685 4.0519 3.9945 3.7949 3.8779 3.9525 3.6376 3.8468 3.9991 3.8811 3.8931 3.9016 1.0467 1.0338 1.0195 0.9998 1.0001 1.0005 1.0014 1.0053 1.0196 1.0153 1.0270 1.0019 0.9891 0.9934 1.0050 1.0102 0.9914 0.9890 0.9899
dispcorr: -0.026062454 hartree
energy: -2050.710353716725
dipole: 7.22846 -8.05425 -0.82579 -11.06716 10.49966 -0.56750 7.36245 -6.19191 1.17054
magnitude: 1.54083 au
magnitude: 3.91647 debye
