program: Orca
programVersion: 5.0.2
elementType: Cl Cl O O O N C C C C C C C C C C C C C C C C C C C C C C H H H H H H H H H H H H H H H H H H H
charge: 0
multiplicity: 1
keywords: wb97x-d3
keywords: def2-TZVPP
keywords: def2/J RIJCOSX
keywords: DEFGRID2
keywords: scfconv7
keywords: smallprint printgap noloewdin
keywords: NOSOSCF
formula: C22H19Cl2NO3
InChI: InChI=1/C22H19Cl2NO3/c1-22(2)17(12-19(23)24)20(22)21(26)28-18(13-25)14-7-6-10-16(11-14)27-15-8-4-3-5-9-15/h3-12,17-18,20H,1-2H3
47 atoms
Cl -4.102701 -2.08579 1.90973
Cl -5.450147 -1.357945 -0.536127
O  1.740875 -1.829067 -1.105672
O  1.076371 -2.070391 1.01458
O  1.078024 3.098581 -0.830968
N  4.599494 -1.530619 -2.714674
C  -0.986764 -3.984346 -0.497812
C  -1.662385 -2.756035 0.043822
C  -0.410957 -2.611584 -0.791676
C  -0.306359 -4.900298 0.488268
C  -1.58629 -4.714455 -1.673886
C  -2.930322 -2.262605 -0.511802
C  0.839504 -2.153183 -0.161526
C  -4.00856 -1.952331 0.196367
C  2.995546 -1.347471 -0.659143
C  2.957699 0.090453 -0.187774
C  3.881442 -1.460294 -1.82093
C  2.01361 0.971553 -0.689829
C  3.913789 0.522634 0.722219
C  2.025121 2.297577 -0.272972
C  3.9262 1.852337 1.110671
C  2.989915 2.750163 0.618928
C  0.732109 4.291101 -0.248253
C  0.775956 5.428219 -1.039937
C  0.286313 4.353462 1.065915
C  0.364515 6.643563 -0.509679
C  -0.10883 5.5766 1.587249
C  -0.072431 6.723926 0.804821
H  -1.523619 -2.601535 1.108101
H  -0.545263 -2.274541 -1.813729
H  0.552003 -5.395713 0.029886
H  -1.003457 -5.677874 0.805649
H  0.037119 -4.388121 1.384814
H  -2.003265 -4.045804 -2.426233
H  -2.383004 -5.383192 -1.342399
H  -0.825999 -5.324014 -2.165716
H  -2.997977 -2.13584 -1.585992
H  3.407926 -1.986992 0.129001
H  1.263842 0.651324 -1.403169
H  4.645077 -0.17014 1.119473
H  4.675396 2.201382 1.809081
H  3.024568 3.785116 0.932557
H  1.119721 5.360384 -2.064568
H  0.244224 3.460666 1.677697
H  0.39222 7.530511 -1.129367
H  -0.451648 5.629293 2.612559
H  -0.38595 7.673691 1.217803
elementType: Cl O N C H
totalener: -2050.68642098 hartree
nucrepener: 2700.67813646 hartree
electener: -4751.36455744 hartree
oneelecener: -8176.86678588 hartree
twoeener: 3425.50222844 hartree
cpcmener: -0.03223687 hartree
kineticenergy: 2044.46539216 hartree
xcener: -151.862602820491 hartree
chargesum: 0.0000000
charge: -0.054726 -0.058740 -0.285646 -0.433175 -0.321509 -0.087522 0.087699 0.029197 -0.082917 -0.263905 -0.256212 -0.199745 0.374460 0.034436 0.396722 0.024671 -0.226260 -0.220579 -0.217256 0.265384 -0.131713 -0.193419 0.262898 -0.225771 -0.191828 -0.130871 -0.143571 -0.171134 0.083330 0.099993 0.101110 0.098985 0.094500 0.089599 0.101371 0.099469 0.133223 0.146218 0.132479 0.145148 0.159832 0.154245 0.146519 0.159438 0.158017 0.159065 0.158490
qa: -0.0547 -0.0587 -0.2856 -0.4332 -0.3215 -0.0875 0.0877 0.0292 -0.0829 -0.2639 -0.2562 -0.1997 0.3745 0.0344 0.3967 0.0247 -0.2263 -0.2206 -0.2173 0.2654 -0.1317 -0.1934 0.2629 -0.2258 -0.1918 -0.1309 -0.1436 -0.1711 0.0833 0.1000 0.1011 0.0990 0.0945 0.0896 0.1014 0.0995 0.1332 0.1462 0.1325 0.1451 0.1598 0.1542 0.1465 0.1594 0.1580 0.1591 0.1585
va: 1.2707 1.2463 2.1173 2.0784 2.0847 3.1132 3.7511 3.8578 3.8474 3.9067 3.9028 3.8841 4.1958 4.2108 3.7223 3.6621 4.0654 4.0513 3.9980 3.7993 3.9130 3.9033 3.6964 4.0094 3.9307 3.8884 3.8838 3.8957 1.0459 1.0326 0.9997 1.0006 1.0168 1.0049 1.0015 1.0018 1.0148 1.0167 1.0294 1.0025 0.9907 0.9984 1.0066 0.9951 0.9895 0.9902 0.9902
dispcorr: -0.022822852 hartree
energy: -2050.709243834185
dipole: 20.31622 -20.66580 -0.34958 1.66534 -1.56351 0.10183 -1.65539 2.29476 0.63937
magnitude: 0.73578 au
magnitude: 1.87020 debye
