program: Orca
programVersion: 5.0.2
elementType: Cl Cl O O O N C C C C C C C C C C C C C C C C C C C C C C H H H H H H H H H H H H H H H H H H H
charge: 0
multiplicity: 1
keywords: wb97x-d3
keywords: def2-TZVPP
keywords: def2/J RIJCOSX
keywords: DEFGRID2
keywords: scfconv7
keywords: smallprint printgap noloewdin
keywords: NOSOSCF
formula: C22H19Cl2NO3
InChI: InChI=1/C22H19Cl2NO3/c1-22(2)17(12-19(23)24)20(22)21(26)28-18(13-25)14-7-6-10-16(11-14)27-15-8-4-3-5-9-15/h3-12,17-18,20H,1-2H3
47 atoms
Cl -4.44554 -1.547046 0.773608
Cl -5.191935 -1.535661 -2.012368
O  1.794481 -1.946085 -0.486053
O  0.517492 -1.932864 1.354342
O  1.834816 3.203754 1.633823
N  5.071584 -2.420783 -0.59607
C  -0.976578 -4.147457 -0.383755
C  -1.781385 -2.888535 -0.235491
C  -0.342589 -2.807038 -0.702997
C  -0.604257 -4.889364 0.875471
C  -1.213394 -5.063166 -1.55986
C  -2.847749 -2.519463 -1.173249
C  0.658702 -2.191777 0.187583
C  -3.997465 -1.946053 -0.840223
C  2.855953 -1.297806 0.213963
C  2.847276 0.182463 -0.072907
C  4.089538 -1.934295 -0.251644
C  2.350048 1.048443 0.890139
C  3.270103 0.668882 -1.30528
C  2.29019 2.411144 0.625111
C  3.211813 2.030258 -1.55249
C  2.729699 2.910232 -0.594491
C  1.217547 4.395907 1.356178
C  0.186373 4.486158 0.429229
C  1.616871 5.505452 2.085042
C  -0.438737 5.708049 0.230412
C  0.972679 6.718698 1.885645
C  -0.050459 6.827453 0.954847
H  -1.936787 -2.579131 0.791587
H  -0.179817 -2.621312 -1.758836
H  0.345717 -5.412443 0.749044
H  -1.366187 -5.639397 1.095041
H  -0.522765 -4.244589 1.748263
H  -2.07809 -5.703554 -1.376416
H  -0.348031 -5.710664 -1.711028
H  -1.384643 -4.529386 -2.49409
H  -2.689262 -2.716652 -2.226827
H  2.785311 -1.477235 1.290288
H  2.012392 0.672724 1.848508
H  3.652418 -0.000497 -2.066053
H  3.554704 2.419497 -2.501918
H  2.708623 3.971928 -0.803189
H  -0.132363 3.615766 -0.130583
H  2.418765 5.416895 2.807193
H  -1.240197 5.781271 -0.493318
H  1.280635 7.583685 2.458257
H  -0.544532 7.776905 0.796396
elementType: Cl O N C H
totalener: -2050.68678051 hartree
nucrepener: 2682.12249499 hartree
electener: -4732.80927550 hartree
oneelecener: -8139.61021713 hartree
twoeener: 3406.80094162 hartree
cpcmener: -0.02992121 hartree
kineticenergy: 2044.46759759 hartree
xcener: -151.862005417552 hartree
chargesum: 0.0000000
charge: -0.055122 -0.060501 -0.276166 -0.444979 -0.324184 -0.090438 0.084490 0.030120 -0.090525 -0.262250 -0.263482 -0.203535 0.409371 0.043486 0.396755 0.003957 -0.218630 -0.204264 -0.207550 0.264284 -0.146799 -0.178533 0.269857 -0.187658 -0.234774 -0.145314 -0.127350 -0.176574 0.077872 0.098311 0.100481 0.099245 0.093429 0.101921 0.098788 0.090753 0.128896 0.131512 0.132959 0.143767 0.160620 0.157246 0.158407 0.145885 0.159176 0.158328 0.158715
qa: -0.0551 -0.0605 -0.2762 -0.4450 -0.3242 -0.0904 0.0845 0.0301 -0.0905 -0.2622 -0.2635 -0.2035 0.4094 0.0435 0.3968 0.0040 -0.2186 -0.2043 -0.2076 0.2643 -0.1468 -0.1785 0.2699 -0.1877 -0.2348 -0.1453 -0.1274 -0.1766 0.0779 0.0983 0.1005 0.0992 0.0934 0.1019 0.0988 0.0908 0.1289 0.1315 0.1330 0.1438 0.1606 0.1572 0.1584 0.1459 0.1592 0.1583 0.1587
va: 1.2702 1.2443 2.1311 2.0670 2.0797 3.1082 3.7523 3.8598 3.8319 3.9098 3.9076 3.9043 4.2048 4.2115 3.7230 3.6914 4.0698 4.0347 3.9964 3.7794 3.9315 3.9156 3.6953 3.9206 4.0074 3.8894 3.8866 3.9010 1.0511 1.0318 0.9997 1.0002 1.0170 1.0009 1.0015 1.0057 1.0191 1.0270 1.0265 1.0086 0.9914 0.9962 0.9954 1.0076 0.9903 0.9893 0.9902
dispcorr: -0.022442075 hartree
energy: -2050.709222585459
dipole: 19.15875 -19.87265 -0.71391 0.88362 -0.35563 0.52800 -0.10492 -0.86308 -0.96800
magnitude: 1.31357 au
magnitude: 3.33883 debye
