program: Gaussian 09
title: 000074393
version: EM64L-G09RevD.01
frameworkgroup: C1[X(C3H8Cl2Si)]
method: RPBEPBE
basis: SDD
operation: Freq
keyword: #p
keyword: freq=noraman
keyword: PBEPBE/SDD
title: #p freq=noraman PBEPBE/SDD
converged: YES YES NO NO
title: Mulliken charges:
elementType: Cl Cl Si C C C H H H H H H H H
charge: -0.327036 -0.078630 1.102467 -0.854900 -0.986404 -0.986368 0.295663 0.295870 0.259075 0.256068 0.254510 0.256067 0.259043 0.254576
chargesum: 0.00000
title: Mulliken charges with hydrogens summed into heavy atoms:
elementType: Cl Cl Si C C C
charge: -0.327036 -0.078630 1.102467 -0.263367 -0.216751 -0.216682
polarizability: 9.02520250e+01 8.22354269e+00 6.65272346e+01 4.39750336e-02 1.91674866e-02 6.26065116e+01
1716.lowfreq: -8.0863 -0.0031 0.0022 0.0029 8.9325 16.0965 60.4766 98.0992 122.1779
frequency: 60.2290 98.0991 122.0576 133.4134 161.6508 163.8172 206.2814 214.6280 248.4643 426.9048 584.7575 631.8038 712.7317 742.3188 748.5818 823.8156 875.8576 897.6996 926.0761 1080.7990 1191.0423 1310.3195 1319.5770 1412.8052 1435.8185 1441.1698 1444.4612 1452.9585 2993.4032 2994.2865 3058.1099 3097.8890 3099.2153 3107.2893 3107.9043 3145.1278
redmass: 3.5816 6.5519 1.0647 1.0341 3.1366 4.3618 3.0508 2.5556 4.8973 9.0294 5.8760 5.5763 2.1061 1.4458 3.9670 1.3211 1.6584 1.4205 1.5005 1.0403 1.1771 1.1978 1.1864 1.0793 1.0508 1.0519 1.0468 1.0467 1.0345 1.0344 1.0559 1.0983 1.0981 1.0990 1.0989 1.1089
irintensity: 4.8919 8.3104 0.0085 0.0059 3.0925 0.2177 4.0232 2.9243 5.3196 55.1066 26.2610 7.8057 1.7935 5.5390 11.3693 10.7757 81.3195 115.3340 91.1006 8.8555 3.9326 50.3829 22.6113 10.7640 3.3941 0.8146 13.2750 15.9673 4.3250 3.1360 5.4567 1.1015 10.4768 4.0840 9.6038 2.1694
temp: 298.150 k
press: 1.00000 atm
elementType: 17 17 14 6 6 6 1 1 1 1 1 1 1 1
symmnumber: 1
zpe: 271979.2 jmol-1
zpe.correction: 0.103591 hartree
zpe.thermalcorrener: 0.113389 hartree
zpe.thermalcorrenthalpy: 0.114333 hartree
zpe.thermalcorrgfe: 0.067632 hartree
zpe.sumelectzpe: -1328.188767 hartree
zpe.sumelectthermal: -1328.178970 hartree
zpe.sumelectthermalent: -1328.178025 hartree
zpe.sumelectthermalfe: -1328.224727 hartree
dipole: 0.7004 1.2951 -0.0047
dipole: 1.4723
quadrupole: -71.4171 -56.1035 -56.5468
quadrupole: -3.0658 -0.0111 0.0075
quadrupole: -10.0613 5.2523 4.8090 -3.0658 -0.0111 0.0075
hfenergy: -1328.2923586 hartree
pointgroup: C01 [X(C3H8Cl2Si1)]
dipole: 0.2000874 -0.5432508 0.0195505 debye
dipolederiv: -0.7383784 0.2030888 0.0012381 0.1830184 -0.5594843 0.0011068 0.001484 0.0007449 -0.4050278 -0.6077894 0.1126468 0.0082626 0.0871373 -0.227105 -0.0006444 0.0094215 -0.0013444 -0.1732482 1.5867205 -0.168786 -0.0011124 0.0009923 1.3551006 -0.0026973 -0.0071924 0.0022966 1.3103579 0.230319 -0.2204574 -0.0041541 -0.2298285 -0.0976843 0.003444 -0.0039325 0.0028592 -0.1987916 -0.3354865 0.0126107 -0.0187078 -0.0422852 -0.3684213 0.056997 0.0071776 0.0510167 -0.4382084 -0.3348672 0.0104391 0.0123908 -0.0458877 -0.3771314 -0.0590836 -0.0093343 -0.0561997 -0.4299649 -0.0025357 0.0235549 -0.0450153 0.0147026 0.0082961 -0.0988743 -0.0277459 -0.0840358 0.0234753 0.0013827 0.0316197 0.0439953 0.0224123 0.0212183 0.0976611 0.0274399 0.0823185 0.0067986 0.114776 -0.0029797 -0.0029769 0.0075264 0.0550754 -0.0761213 -0.0115245 -0.1058255 -0.0549258 -0.0112558 -0.0991423 0.0167803 -0.1166826 0.0315165 0.0116164 0.0415144 0.0318306 0.1081151 -0.003679 0.0984208 -0.015703 0.112149 0.0326962 0.0170798 -0.0433716 0.0382929 0.102755 -0.0141841 -0.1010036 -0.0025158 -0.1193527 0.0297442 0.0008399 -0.0258707 -0.0203348 0.1129082 0.1150428 0.0022582 -0.0060872 0.0117079 0.0682482 0.0661145 0.0018038 0.0963609 -0.0683984 -0.0000651 0.0977299 0.0136054 0.1143907 0.027931 -0.0174385 0.0401306 -0.0379802 0.1041551 unknown
polarizability: 87.4269378|-11.2531127|69.3470097|-0.2689504|0.0580229|62.6118237 unknown
InChI: InChI=1S/C3H8Cl2Si/c1-6(2,5)3-4/h3H2,1-2H3
charge 0 multiplicity 1
14 atoms
Cl -2.17938 1.27304 -0.006533
Cl 2.647976 0.041771 -0.093409
Si -0.432755 -0.116598 0.001643
C  1.054663 1.084505 -0.084235
C  -0.483948 -1.069703 1.636405
C  -0.569591 -1.192686 -1.549771
H  1.128003 1.745586 0.792598
H  1.075656 1.682583 -1.007828
H  -0.493881 -0.37868 2.496838
H  -1.388699 -1.69974 1.692292
H  0.403573 -1.722759 1.724056
H  -1.476781 -1.820432 -1.50964
H  -0.624045 -0.569314 -2.45886
H  0.311407 -1.854975 -1.633457
