program: Orca
programVersion: 5.0.2
elementType: Cl Cl O O O N C C C C C C C C C C C C C C C C C C C C C C H H H H H H H H H H H H H H H H H H H
charge: 0
multiplicity: 1
keywords: wb97x-d3
keywords: def2-TZVPP
keywords: def2/J RIJCOSX
keywords: DEFGRID2
keywords: scfconv7
keywords: smallprint printgap noloewdin
keywords: NOSOSCF
formula: C22H19Cl2NO3
InChI: InChI=1/C22H19Cl2NO3/c1-22(2)17(12-19(23)24)20(22)21(26)28-18(13-25)14-7-6-10-16(11-14)27-15-8-4-3-5-9-15/h3-12,17-18,20H,1-2H3
47 atoms
Cl -1.784835 0.387585 2.691495
Cl -4.173919 0.840575 1.140482
O  1.398773 -1.957345 -1.110661
O  1.462121 -2.666355 1.006012
O  0.995191 2.834172 0.53208
N  3.569027 -1.077117 -3.429496
C  -1.476271 -3.642595 0.488804
C  -1.511886 -2.24032 1.006984
C  -0.621362 -2.593913 -0.185597
C  -0.860165 -4.704061 1.366448
C  -2.622637 -4.164984 -0.344715
C  -2.635996 -1.322867 0.788098
C  0.828532 -2.444683 0.00737
C  -2.833427 -0.193384 1.456754
C  2.739962 -1.514121 -0.990149
C  2.854425 -0.239207 -0.180207
C  3.189949 -1.276901 -2.364025
C  1.838929 0.707694 -0.23982
C  3.983023 -0.024521 0.595287
C  1.964851 1.87997 0.493282
C  4.096494 1.15616 1.316103
C  3.095842 2.11138 1.268168
C  0.118413 2.970447 -0.514176
C  -1.23649 2.981279 -0.224109
C  0.571573 3.15304 -1.814495
C  -2.149454 3.184366 -1.25028
C  -0.351733 3.342095 -2.831456
C  -1.712681 3.359643 -2.555188
H  -0.961338 -2.090127 1.928788
H  -0.978849 -2.263344 -1.153625
H  -1.643044 -5.183402 1.956911
H  -0.120226 -4.315367 2.061549
H  -0.384428 -5.47788 0.761567
H  -3.450043 -4.477655 0.294845
H  -2.300539 -5.035002 -0.919077
H  -3.005844 -3.434657 -1.056716
H  -3.355892 -1.565458 0.015942
H  3.384266 -2.290068 -0.563225
H  0.957257 0.53106 -0.843183
H  4.765477 -0.771637 0.640149
H  4.973558 1.334311 1.924077
H  3.182622 3.030954 1.833107
H  -1.571617 2.846632 0.796134
H  1.631937 3.151385 -2.034115
H  -3.2075 3.199019 -1.02515
H  -0.001481 3.484253 -3.845461
H  -2.427276 3.514165 -3.352854
elementType: Cl O N C H
totalener: -2050.68476799 hartree
nucrepener: 2919.58946019 hartree
electener: -4970.27422818 hartree
oneelecener: -8614.92544872 hartree
twoeener: 3644.65122054 hartree
cpcmener: -0.03082049 hartree
kineticenergy: 2044.47851056 hartree
xcener: -151.866234484320 hartree
chargesum: 0.0000000
charge: -0.056360 -0.059819 -0.290427 -0.436013 -0.323494 -0.087092 0.111312 -0.010879 -0.057410 -0.266291 -0.280988 -0.176920 0.362791 0.049700 0.409135 0.012795 -0.229821 -0.188643 -0.219660 0.261689 -0.105143 -0.240695 0.278251 -0.235514 -0.187809 -0.114596 -0.139060 -0.183091 0.092048 0.099924 0.096408 0.094879 0.100356 0.105471 0.100381 0.092388 0.128647 0.146236 0.140828 0.144261 0.158622 0.147291 0.133309 0.155375 0.150212 0.159670 0.157742
qa: -0.0564 -0.0598 -0.2904 -0.4360 -0.3235 -0.0871 0.1113 -0.0109 -0.0574 -0.2663 -0.2810 -0.1769 0.3628 0.0497 0.4091 0.0128 -0.2298 -0.1886 -0.2197 0.2617 -0.1051 -0.2407 0.2783 -0.2355 -0.1878 -0.1146 -0.1391 -0.1831 0.0920 0.0999 0.0964 0.0949 0.1004 0.1055 0.1004 0.0924 0.1286 0.1462 0.1408 0.1443 0.1586 0.1473 0.1333 0.1554 0.1502 0.1597 0.1577
va: 1.2692 1.2446 2.1093 2.0739 2.0844 3.1130 3.7869 3.8924 3.8069 3.8928 3.9145 3.9272 4.2043 4.1844 3.7251 3.6580 4.0700 3.9239 3.9954 3.7383 3.8960 4.0086 3.7254 3.9858 3.9312 3.8872 3.8855 3.9374 1.0439 1.0321 1.0003 1.0194 0.9996 0.9994 1.0013 1.0042 1.0210 1.0157 1.0210 1.0024 0.9888 1.0061 1.0293 0.9976 0.9991 0.9895 0.9908
dispcorr: -0.027233345 hartree
energy: -2050.712001339318
dipole: 4.45368 -5.53610 -1.08241 -16.14037 15.08938 -1.05099 -8.87283 9.12833 0.25551
magnitude: 1.53019 au
magnitude: 3.88944 debye
