program: Orca
programVersion: 5.0.2
elementType: Cl Cl O O O N C C C C C C C C C C C C C C C C C C C C C C H H H H H H H H H H H H H H H H H H H
charge: 0
multiplicity: 1
keywords: wb97x-d3
keywords: def2-TZVPP
keywords: def2/J RIJCOSX
keywords: DEFGRID2
keywords: scfconv7
keywords: smallprint printgap noloewdin
keywords: NOSOSCF
formula: C22H19Cl2NO3
InChI: InChI=1/C22H19Cl2NO3/c1-22(2)17(12-19(23)24)20(22)21(26)28-18(13-25)14-7-6-10-16(11-14)27-15-8-4-3-5-9-15/h3-12,17-18,20H,1-2H3
47 atoms
Cl -1.670192 -0.373964 -1.189226
Cl -4.015521 -1.250183 -2.631884
O  1.738146 -2.352556 -0.273377
O  0.656284 -2.127133 1.669548
O  0.701891 2.767958 1.729324
N  4.832166 -1.781023 -1.27023
C  -1.221308 -4.38879 0.528515
C  -1.795355 -3.042012 0.270393
C  -0.359147 -3.327723 -0.136516
C  -0.965531 -4.806114 1.95542
C  -1.617053 -5.534165 -0.371565
C  -2.798944 -2.76628 -0.77938
C  0.693432 -2.563965 0.547947
C  -2.828258 -1.618805 -1.443561
C  2.667148 -1.345227 0.123773
C  2.083981 0.017272 -0.161065
C  3.873812 -1.601373 -0.663704
C  1.728695 0.841968 0.894762
C  1.807657 0.391658 -1.471691
C  1.074309 2.04078 0.639768
C  1.156541 1.589746 -1.710885
C  0.77408 2.415991 -0.663368
C  0.579864 4.130148 1.645272
C  1.589626 4.919946 1.110004
C  -0.565835 4.703428 2.175184
C  1.436223 6.298345 1.101447
C  -0.70044 6.085034 2.170954
C  0.294738 6.886662 1.630411
H  -1.882414 -2.403825 1.146365
H  -0.186734 -3.479776 -1.19562
H  -0.097666 -5.464726 2.019866
H  -1.827365 -5.360279 2.33198
H  -0.802576 -3.965418 2.625964
H  -2.555358 -5.978591 -0.034169
H  -0.855539 -6.315521 -0.351341
H  -1.746255 -5.22919 -1.410625
H  -3.559285 -3.507065 -0.998393
H  2.940833 -1.440996 1.178886
H  1.941773 0.553451 1.916886
H  2.083165 -0.246633 -2.302266
H  0.927018 1.884181 -2.726389
H  0.245811 3.337308 -0.872324
H  2.488514 4.470172 0.706639
H  -1.342132 4.073526 2.59158
H  2.221176 6.915425 0.683584
H  -1.593588 6.53298 2.587033
H  0.184032 7.962966 1.623498
elementType: Cl O N C H
totalener: -2050.68282741 hartree
nucrepener: 2829.47203911 hartree
electener: -4880.15486652 hartree
oneelecener: -8434.97181659 hartree
twoeener: 3554.81695007 hartree
cpcmener: -0.02920673 hartree
kineticenergy: 2044.49020833 hartree
xcener: -151.866511027755 hartree
chargesum: 0.0000000
charge: -0.050886 -0.056856 -0.275815 -0.442848 -0.324015 -0.088322 0.140558 -0.050721 -0.102930 -0.269646 -0.280684 -0.213031 0.365491 0.082405 0.418696 0.031944 -0.227696 -0.229975 -0.225638 0.283477 -0.169360 -0.167191 0.266351 -0.183958 -0.234581 -0.146283 -0.127442 -0.175855 0.116588 0.108229 0.100669 0.095450 0.094453 0.102792 0.099991 0.093144 0.140812 0.133984 0.132396 0.141588 0.158682 0.155303 0.158237 0.146847 0.159898 0.157361 0.158387
qa: -0.0509 -0.0569 -0.2758 -0.4428 -0.3240 -0.0883 0.1406 -0.0507 -0.1029 -0.2696 -0.2807 -0.2130 0.3655 0.0824 0.4187 0.0319 -0.2277 -0.2300 -0.2256 0.2835 -0.1694 -0.1672 0.2664 -0.1840 -0.2346 -0.1463 -0.1274 -0.1759 0.1166 0.1082 0.1007 0.0954 0.0945 0.1028 0.1000 0.0931 0.1408 0.1340 0.1324 0.1416 0.1587 0.1553 0.1582 0.1468 0.1599 0.1574 0.1584
va: 1.3056 1.2504 2.1243 2.0630 2.0789 3.1113 3.7262 3.8862 3.8178 3.8858 3.9140 3.8988 4.2025 4.1857 3.7288 3.5884 4.0704 4.0587 3.9585 3.7513 3.8951 3.8777 3.6977 3.9176 4.0080 3.8886 3.8876 3.8986 1.0238 1.0262 0.9993 1.0010 1.0177 0.9990 1.0027 0.9994 1.0081 1.0183 1.0269 1.0119 0.9936 0.9970 0.9961 1.0071 0.9900 0.9895 0.9903
dispcorr: -0.026156043 hartree
energy: -2050.708983451917
dipole: 4.67441 -6.40581 -1.73140 -4.83857 4.72180 -0.11677 14.27829 -14.12470 0.15359
magnitude: 1.74211 au
magnitude: 4.42810 debye
