program: Orca
programVersion: 5.0.2
elementType: Cl Cl O O O N C C C C C C C C C C C C C C C C C C C C C C H H H H H H H H H H H H H H H H H H H
charge: 0
multiplicity: 1
keywords: wb97x-d3
keywords: def2-TZVPP
keywords: def2/J RIJCOSX
keywords: DEFGRID2
keywords: scfconv7
keywords: smallprint printgap noloewdin
keywords: NOSOSCF
formula: C22H19Cl2NO3
InChI: InChI=1/C22H19Cl2NO3/c1-22(2)17(12-19(23)24)20(22)21(26)28-18(13-25)14-7-6-10-16(11-14)27-15-8-4-3-5-9-15/h3-12,17-18,20H,1-2H3
47 atoms
Cl -3.682897 -3.373155 2.571096
Cl -5.533836 -1.943581 0.882118
O  1.484829 -1.502512 -0.996644
O  1.103704 -2.477827 0.983611
O  1.714792 3.574613 -1.245687
N  4.313541 -1.303215 -2.689905
C  -1.071339 -3.848355 -0.974579
C  -1.681077 -3.066166 0.157341
C  -0.608766 -2.432039 -0.696284
C  -0.189487 -5.018046 -0.615565
C  -1.842891 -4.0542 -2.254612
C  -3.047415 -2.533924 0.085809
C  0.718437 -2.161984 -0.111398
C  -3.955998 -2.614864 1.04966
C  2.78223 -1.093208 -0.58255
C  2.767011 0.325738 -0.069375
C  3.629048 -1.211774 -1.772292
C  2.222493 1.331327 -0.858372
C  3.282708 0.616116 1.185078
C  2.210328 2.637218 -0.392482
C  3.265863 1.928068 1.637846
C  2.737283 2.944693 0.858743
C  1.179742 4.742986 -0.768255
C  1.626861 5.928277 -1.331604
C  0.177631 4.743204 0.194018
C  1.05945 7.129618 -0.929275
C  -0.371743 5.952017 0.595517
C  0.064492 7.147192 0.03788
H  -1.352656 -3.378807 1.14203
H  -0.929323 -1.698893 -1.428643
H  0.583003 -5.168068 -1.372558
H  -0.788295 -5.92965 -0.570927
H  0.301214 -4.905456 0.349964
H  -2.543743 -4.884794 -2.151578
H  -1.158846 -4.298286 -3.069368
H  -2.409297 -3.175249 -2.560731
H  -3.346914 -2.02628 -0.823565
H  3.189759 -1.765867 0.178121
H  1.816128 1.113486 -1.839695
H  3.698117 -0.170165 1.802272
H  3.674344 2.166671 2.610955
H  2.747171 3.962819 1.225946
H  2.405976 5.908945 -2.083613
H  -0.17684 3.814003 0.623239
H  1.403877 8.055141 -1.372344
H  -1.152916 5.956023 1.344908
H  -0.372675 8.085829 0.351854
elementType: Cl O N C H
totalener: -2050.68651226 hartree
nucrepener: 2665.88223156 hartree
electener: -4716.56874383 hartree
oneelecener: -8107.05227762 hartree
twoeener: 3390.48353379 hartree
cpcmener: -0.03111653 hartree
kineticenergy: 2044.46063646 hartree
xcener: -151.859896058065 hartree
chargesum: 0.0000000
charge: -0.055241 -0.060118 -0.283221 -0.437517 -0.323016 -0.088040 0.085683 0.025409 -0.086688 -0.260043 -0.260365 -0.200119 0.387561 0.037513 0.409506 0.016489 -0.225410 -0.240576 -0.187115 0.251343 -0.140112 -0.176645 0.260227 -0.229286 -0.183721 -0.129454 -0.145482 -0.173031 0.077888 0.101024 0.101879 0.099548 0.092753 0.101970 0.099430 0.090077 0.131277 0.134241 0.136238 0.148086 0.160428 0.156364 0.146631 0.158730 0.157406 0.159091 0.158406
qa: -0.0552 -0.0601 -0.2832 -0.4375 -0.3230 -0.0880 0.0857 0.0254 -0.0867 -0.2600 -0.2604 -0.2001 0.3876 0.0375 0.4095 0.0165 -0.2254 -0.2406 -0.1871 0.2513 -0.1401 -0.1766 0.2602 -0.2293 -0.1837 -0.1295 -0.1455 -0.1730 0.0779 0.1010 0.1019 0.0995 0.0928 0.1020 0.0994 0.0901 0.1313 0.1342 0.1362 0.1481 0.1604 0.1564 0.1466 0.1587 0.1574 0.1591 0.1584
va: 1.2699 1.2447 2.1271 2.0773 2.0795 3.1094 3.7589 3.8662 3.8243 3.9087 3.9032 3.8923 4.2271 4.2102 3.7090 3.6739 4.0857 4.0643 3.9551 3.8023 3.9190 3.9048 3.7017 4.0066 3.9251 3.8882 3.8891 3.8971 1.0498 1.0301 0.9998 1.0004 1.0155 1.0013 1.0018 1.0054 1.0168 1.0258 1.0270 1.0023 0.9912 0.9970 1.0069 0.9953 0.9896 0.9902 0.9901
dispcorr: -0.022477075 hartree
energy: -2050.708989339731
dipole: 18.14728 -18.83690 -0.68962 8.77913 -8.04991 0.72922 -11.48149 11.92533 0.44384
magnitude: 1.09742 au
magnitude: 2.78942 debye
