program: Gaussian 09
title: 000074392
version: EM64L-G09RevD.01
frameworkgroup: C1[X(C2F4S2)]
method: RPBEPBE
basis: SDD
operation: Freq
keyword: #p
keyword: freq=noraman
keyword: PBEPBE/SDD
title: #p freq=noraman PBEPBE/SDD
converged: NO NO NO NO
title: Mulliken charges:
elementType: S S F F F F C C
charge: 0.436386 0.436386 -0.114466 -0.112591 -0.114427 -0.112622 -0.209340 -0.209325
chargesum: 0.00000
title: Mulliken charges with hydrogens summed into heavy atoms:
polarizability: 6.34691234e+01 -8.64722735e-05 6.01609973e+01 -4.19676212e-04 2.70422456e-04 3.54168161e+01
1716.lowfreq: -15.9666 -0.0018 -0.0016 0.0018 3.9306 7.4665 44.8493 203.2776 253.0361
frequency: 44.8493 203.2773 253.0337 290.9342 298.0342 334.5005 373.7286 385.7518 385.9684 474.9843 561.8037 581.1630 712.9033 849.8447 954.7679 978.4725 1008.0808 1056.7307
redmass: 21.8497 18.9984 22.8453 18.4354 23.6150 16.7373 26.5543 23.5077 19.5864 30.2302 17.8477 17.7659 12.4166 13.1404 13.7828 13.5532 13.4642 13.1134
irintensity: 1.5794 0.0000 0.0001 0.0000 3.5825 0.0000 0.0000 0.0004 0.6883 0.0001 39.6926 0.0013 0.0000 124.4941 667.0001 17.6249 385.1142 2.0790
temp: 298.150 k
press: 1.00000 atm
elementType: 16 16 9 9 9 9 6 6
symmnumber: 1
zpe: 58310.9 jmol-1
zpe.correction: 0.022209 hartree
zpe.thermalcorrener: 0.030059 hartree
zpe.thermalcorrenthalpy: 0.031003 hartree
zpe.thermalcorrgfe: -0.011329 hartree
zpe.sumelectzpe: -1271.040524 hartree
zpe.sumelectthermal: -1271.032675 hartree
zpe.sumelectthermalent: -1271.031730 hartree
zpe.sumelectthermalfe: -1271.074062 hartree
dipole: 0.0001 0.0000 -0.0239
dipole: 0.0239
quadrupole: -62.2986 -55.0932 -62.2491
quadrupole: 0.0000 0.0008 0.0002
quadrupole: -2.4183 4.7871 -2.3688 0.0000 0.0008 0.0002
hfenergy: -1271.0627337 hartree
pointgroup: C01 [X(C2F4S2)]
dipole: -0.0000512 0.0093847 -0.0000033 debye
dipolederiv: -0.4296947 -0.0003304 0.0000065 -0.0003308 -0.0504659 -0.0000524 -0.0000033 0.0000689 -0.3110328 -0.4296948 -0.0003312 -0.0000032 -0.0003291 -0.050466 -0.0001506 0.0000035 -0.0002738 -0.3110319 -0.7216524 0.3349426 -0.0001371 0.411055 -0.6351014 0.000153 -0.0001672 0.0001536 -0.2543209 -0.7235465 -0.336851 0.0001246 -0.4115714 -0.6350404 0.0001434 0.0001527 0.0001433 -0.2534928 -0.7203764 -0.3351033 0.0001252 -0.4112394 -0.6364079 0.000147 0.0001569 0.0001496 -0.2543089 -0.7248336 0.3366859 -0.0001387 0.4113977 -0.6337322 0.0001554 -0.0001708 0.000159 -0.2535073 1.8748899 0.0019447 0.000011 0.0006315 1.3206037 -0.0001937 0.0000146 -0.0001946 0.818835 1.8749085 -0.0009573 0.0000117 0.0003864 1.32061 -0.000202 0.0000136 -0.000206 0.8188595 unknown
polarizability: 63.4691037|0.0235168|35.4168394|-0.0000564|0.0094128|60.1609937 unknown
InChI: InChI=1S/C2F4S2/c3-1(4)7-2(5,6)8-1
charge 0 multiplicity 1
8 atoms
S  0.000014 0.000669 -1.452707
S  -0.000026 0.001793 1.45273
F  2.071266 -1.121897 0.000476
F  2.072545 1.122765 -0.000398
F  -2.069315 -1.125454 0.000438
F  -2.074546 1.119202 -0.000463
C  1.222061 0.002526 0.000025
C  -1.222099 0.000396 -0.000001
