program: Orca
programVersion: 5.0.2
elementType: Cl Cl O O O N C C C C C C C C C C C C C C C C C C C C C C H H H H H H H H H H H H H H H H H H H
charge: 0
multiplicity: 1
keywords: wb97x-d3
keywords: def2-TZVPP
keywords: def2/J RIJCOSX
keywords: DEFGRID2
keywords: scfconv7
keywords: smallprint printgap noloewdin
keywords: NOSOSCF
formula: C22H19Cl2NO3
InChI: InChI=1/C22H19Cl2NO3/c1-22(2)17(12-19(23)24)20(22)21(26)28-18(13-25)14-7-6-10-16(11-14)27-15-8-4-3-5-9-15/h3-12,17-18,20H,1-2H3
47 atoms
Cl -4.612585 -1.610313 -0.310755
Cl -4.894738 -2.897314 -2.876017
O  1.704028 -2.016429 -0.3523
O  0.226046 -1.467471 1.230586
O  2.458441 3.515613 1.604669
N  4.957943 -1.72804 -0.801398
C  -1.00211 -4.242653 0.31693
C  -1.831592 -3.099563 -0.191882
C  -0.333954 -3.10539 -0.432578
C  -0.840805 -4.377462 1.810847
C  -1.023801 -5.573461 -0.395766
C  -2.727394 -3.242429 -1.345676
C  0.510567 -2.115491 0.257499
C  -3.912012 -2.659966 -1.481104
C  2.630796 -1.097755 0.206129
C  2.304914 0.343463 -0.111872
C  3.925376 -1.462368 -0.375077
C  2.465158 1.297457 0.879493
C  1.878825 0.709669 -1.383409
C  2.218989 2.635301 0.59534
C  1.621662 2.045397 -1.647048
C  1.794828 3.01734 -0.671001
C  1.820299 4.729807 1.630504
C  2.602385 5.869998 1.729696
C  0.433872 4.812971 1.6247
C  1.986564 7.110215 1.833439
C  -0.16807 6.059148 1.717237
C  0.60275 7.210217 1.822593
H  -2.1599 -2.408515 0.576108
H  -0.003815 -3.353573 -1.435011
H  -0.947447 -3.435148 2.343876
H  0.133949 -4.801301 2.060386
H  -1.602596 -5.057083 2.197252
H  -0.142009 -6.156626 -0.124815
H  -1.027376 -5.480848 -1.481273
H  -1.904279 -6.149553 -0.105186
H  -2.40147 -3.872797 -2.164394
H  2.715042 -1.233784 1.289756
H  2.788032 1.01055 1.873551
H  1.750999 -0.029613 -2.163828
H  1.291632 2.34359 -2.633607
H  1.604982 4.056151 -0.908578
H  3.682062 5.78673 1.733893
H  -0.171088 3.917123 1.555519
H  2.595687 8.001141 1.916415
H  -1.248279 6.127698 1.715016
H  0.12601 8.178583 1.90016
elementType: Cl O N C H
totalener: -2050.68684252 hartree
nucrepener: 2667.84943101 hartree
electener: -4718.53627353 hartree
oneelecener: -8111.21604178 hartree
twoeener: 3392.67976825 hartree
cpcmener: -0.03191854 hartree
kineticenergy: 2044.46558760 hartree
xcener: -151.861889206157 hartree
chargesum: 0.0000000
charge: -0.054518 -0.059989 -0.282387 -0.437628 -0.323778 -0.087623 0.081871 0.029793 -0.068760 -0.265149 -0.266526 -0.203095 0.382052 0.042760 0.398220 0.024395 -0.223655 -0.227162 -0.215261 0.264563 -0.150995 -0.171104 0.249382 -0.221978 -0.176871 -0.133594 -0.147797 -0.168689 0.080491 0.097383 0.094715 0.101373 0.098954 0.099202 0.091619 0.102662 0.128696 0.141964 0.132143 0.147856 0.159111 0.155803 0.146549 0.159505 0.157826 0.159189 0.158483
qa: -0.0545 -0.0600 -0.2824 -0.4376 -0.3238 -0.0876 0.0819 0.0298 -0.0688 -0.2651 -0.2665 -0.2031 0.3821 0.0428 0.3982 0.0244 -0.2237 -0.2272 -0.2153 0.2646 -0.1510 -0.1711 0.2494 -0.2220 -0.1769 -0.1336 -0.1478 -0.1687 0.0805 0.0974 0.0947 0.1014 0.0990 0.0992 0.0916 0.1027 0.1287 0.1420 0.1321 0.1479 0.1591 0.1558 0.1465 0.1595 0.1578 0.1592 0.1585
va: 1.2712 1.2449 2.1256 2.0778 2.0777 3.1129 3.7529 3.8680 3.8260 3.9076 3.9090 3.9011 4.1994 4.2132 3.7248 3.6369 4.0731 4.0783 3.9690 3.7778 3.9349 3.8951 3.7100 4.0027 3.9270 3.8887 3.8896 3.8941 1.0482 1.0324 1.0175 0.9993 1.0002 1.0013 1.0060 1.0004 1.0196 1.0181 1.0194 1.0112 0.9914 0.9974 1.0064 0.9951 0.9895 0.9903 0.9900
dispcorr: -0.022641506 hartree
energy: -2050.709484021409
dipole: 18.08005 -19.05744 -0.97739 3.91734 -4.01010 -0.09276 11.93422 -11.97754 -0.04332
magnitude: 0.98274 au
magnitude: 2.49793 debye
