program: Orca
programVersion: 5.0.2
elementType: Cl Cl O O O N C C C C C C C C C C C C C C C C C C C C C C H H H H H H H H H H H H H H H H H H H
charge: 0
multiplicity: 1
keywords: wb97x-d3
keywords: def2-TZVPP
keywords: def2/J RIJCOSX
keywords: DEFGRID2
keywords: scfconv7
keywords: smallprint printgap noloewdin
keywords: NOSOSCF
formula: C22H19Cl2NO3
InChI: InChI=1/C22H19Cl2NO3/c1-22(2)17(12-19(23)24)20(22)21(26)28-18(13-25)14-7-6-10-16(11-14)27-15-8-4-3-5-9-15/h3-12,17-18,20H,1-2H3
47 atoms
Cl -3.717828 -1.230127 -2.120104
Cl -4.791174 -3.875461 -1.701377
O  1.196023 -1.214993 -0.638522
O  2.120807 -2.882944 0.525179
O  2.392972 3.476322 1.614899
N  2.176948 0.571592 -3.222518
C  -1.157178 -1.805807 1.33861
C  -1.48311 -2.108145 -0.099141
C  -0.233614 -2.689566 0.522869
C  -0.760122 -0.389725 1.678278
C  -1.916638 -2.492568 2.446802
C  -2.570569 -3.025511 -0.468144
C  1.138417 -2.293494 0.152493
C  -3.550059 -2.744281 -1.317991
C  2.48998 -0.715468 -0.971445
C  3.028772 0.193815 0.106009
C  2.303619 -0.001283 -2.235633
C  2.42142 1.426302 0.331118
C  4.099182 -0.222244 0.882541
C  2.896275 2.241178 1.348205
C  4.566382 0.607579 1.89377
C  3.96883 1.83099 2.13519
C  1.146257 3.822451 1.154239
C  1.045108 4.879156 0.264214
C  0.014754 3.162209 1.613865
C  -0.211021 5.283239 -0.168661
C  -1.232958 3.566431 1.16339
C  -1.350634 4.62584 0.272576
H  -1.330581 -1.275196 -0.775128
H  -0.277492 -3.739781 0.79095
H  -0.002272 -0.372137 2.464261
H  -1.63302 0.150893 2.048626
H  -0.377868 0.164908 0.824404
H  -2.864657 -1.984538 2.633629
H  -1.338602 -2.464388 3.372265
H  -2.134388 -3.537999 2.231019
H  -2.581258 -4.009416 -0.01388
H  3.190731 -1.5340 -1.159044
H  1.59655 1.748725 -0.293557
H  4.568238 -1.180384 0.701375
H  5.401244 0.293259 2.506002
H  4.332305 2.476017 2.925365
H  1.938384 5.384516 -0.080996
H  0.106575 2.345568 2.319444
H  -0.294419 6.112169 -0.859562
H  -2.118071 3.052652 1.515732
H  -2.327381 4.939885 -0.071197
elementType: Cl O N C H
totalener: -2050.68442311 hartree
nucrepener: 2819.22123875 hartree
electener: -4869.90566186 hartree
oneelecener: -8413.45286049 hartree
twoeener: 3543.54719863 hartree
cpcmener: -0.03156353 hartree
kineticenergy: 2044.47446352 hartree
xcener: -151.864369836389 hartree
chargesum: 0.0000000
charge: -0.055532 -0.058757 -0.267418 -0.438743 -0.326489 -0.086372 0.111002 0.057741 -0.121606 -0.297812 -0.262547 -0.222885 0.410314 0.041693 0.374483 0.032295 -0.228552 -0.253722 -0.194538 0.289360 -0.111706 -0.236066 0.263171 -0.203293 -0.216153 -0.142953 -0.147718 -0.159312 0.089985 0.100697 0.111243 0.106635 0.087332 0.100507 0.100281 0.090566 0.132797 0.140800 0.144901 0.144302 0.158057 0.146836 0.147070 0.175675 0.158427 0.157772 0.158230
qa: -0.0555 -0.0588 -0.2674 -0.4387 -0.3265 -0.0864 0.1110 0.0577 -0.1216 -0.2978 -0.2625 -0.2229 0.4103 0.0417 0.3745 0.0323 -0.2286 -0.2537 -0.1945 0.2894 -0.1117 -0.2361 0.2632 -0.2033 -0.2162 -0.1430 -0.1477 -0.1593 0.0900 0.1007 0.1112 0.1066 0.0873 0.1005 0.1003 0.0906 0.1328 0.1408 0.1449 0.1443 0.1581 0.1468 0.1471 0.1757 0.1584 0.1578 0.1582
va: 1.2698 1.2471 2.1342 2.0700 2.0909 3.1084 3.7563 3.8216 3.8988 3.9120 3.9032 3.8810 4.1940 4.2112 3.7653 3.6001 4.0745 3.9374 3.9697 3.7524 3.9122 4.0108 3.7033 3.9961 3.9353 3.8905 3.8933 3.9013 1.0335 1.0304 0.9963 0.9978 1.0029 1.0017 1.0011 1.0051 1.0161 1.0166 1.0092 1.0107 0.9892 1.0065 1.0049 0.9816 0.9894 0.9926 0.9901
dispcorr: -0.026738324 hartree
energy: -2050.711161436100
dipole: 15.13094 -15.39353 -0.26259 13.68141 -13.90771 -0.22630 24.57076 -22.52195 2.04881
magnitude: 2.07793 au
magnitude: 5.28168 debye
