program: Orca
programVersion: 5.0.2
elementType: Cl Cl O O O N C C C C C C C C C C C C C C C C C C C C C C H H H H H H H H H H H H H H H H H H H
charge: 0
multiplicity: 1
keywords: wb97x-d3
keywords: def2-TZVPP
keywords: def2/J RIJCOSX
keywords: DEFGRID2
keywords: scfconv7
keywords: smallprint printgap noloewdin
keywords: NOSOSCF
formula: C22H19Cl2NO3
InChI: InChI=1/C22H19Cl2NO3/c1-22(2)17(12-19(23)24)20(22)21(26)28-18(13-25)14-7-6-10-16(11-14)27-15-8-4-3-5-9-15/h3-12,17-18,20H,1-2H3
47 atoms
Cl -3.951592 -0.106191 1.388564
Cl -4.659769 0.358015 -1.368002
O  1.953627 -1.716512 -0.292458
O  0.908765 -1.814449 1.691056
O  2.036474 3.443572 0.335509
N  4.966778 -3.055113 -0.411654
C  -1.261121 -3.356484 0.009306
C  -1.678807 -1.930143 0.2112
C  -0.295788 -2.240162 -0.335645
C  -1.054222 -4.203824 1.240121
C  -1.800321 -4.140565 -1.162642
C  -2.633764 -1.2478 -0.670047
C  0.878588 -1.917132 0.492438
C  -3.610827 -0.446698 -0.26315
C  3.1764 -1.295019 0.308184
C  3.485317 0.114744 -0.138386
C  4.186851 -2.272328 -0.099092
C  2.635786 1.116307 0.321182
C  4.536903 0.424946 -0.988229
C  2.829849 2.422981 -0.098404
C  4.738503 1.7446 -1.372195
C  3.885012 2.745601 -0.942668
C  0.681647 3.257927 0.43102
C  0.040055 3.804145 1.532617
C  -0.040614 2.603838 -0.560205
C  -1.339882 3.696687 1.639265
C  -1.417749 2.495247 -0.434573
C  -2.073839 3.039301 0.661981
H  -1.690722 -1.612319 1.247573
H  -0.154382 -2.07377 -1.397565
H  -0.797978 -3.626251 2.125199
H  -0.267798 -4.943337 1.076807
H  -1.974615 -4.747137 1.461995
H  -1.15612 -4.996741 -1.370044
H  -1.866446 -3.554254 -2.078512
H  -2.797371 -4.523738 -0.937608
H  -2.52826 -1.387189 -1.739475
H  3.106777 -1.333913 1.399433
H  1.831299 0.88017 1.008192
H  5.20537 -0.342804 -1.356171
H  5.560966 1.991002 -2.030462
H  4.032938 3.771442 -1.255645
H  0.615314 4.313185 2.295981
H  0.457332 2.188846 -1.42771
H  -1.84037 4.125519 2.497921
H  -1.9798 1.993064 -1.211283
H  -3.148516 2.956026 0.751627
elementType: Cl O N C H
totalener: -2050.68545095 hartree
nucrepener: 2862.94519289 hartree
electener: -4913.63064384 hartree
oneelecener: -8500.89283559 hartree
twoeener: 3587.26219175 hartree
cpcmener: -0.02871135 hartree
kineticenergy: 2044.45554263 hartree
xcener: -151.861982659381 hartree
chargesum: 0.0000000
charge: -0.055779 -0.062682 -0.278050 -0.442771 -0.328831 -0.083745 0.088491 0.040367 -0.097645 -0.267135 -0.262255 -0.204198 0.412078 0.040887 0.443411 -0.050009 -0.241948 -0.136590 -0.191279 0.212233 -0.112492 -0.227599 0.278133 -0.248879 -0.183129 -0.120114 -0.135252 -0.179335 0.083836 0.097383 0.095281 0.101448 0.097490 0.099352 0.090040 0.101458 0.132459 0.139862 0.154611 0.138317 0.160123 0.148201 0.145872 0.153226 0.156903 0.154392 0.143864
qa: -0.0558 -0.0627 -0.2780 -0.4428 -0.3288 -0.0837 0.0885 0.0404 -0.0976 -0.2671 -0.2623 -0.2042 0.4121 0.0409 0.4434 -0.0500 -0.2419 -0.1366 -0.1913 0.2122 -0.1125 -0.2276 0.2781 -0.2489 -0.1831 -0.1201 -0.1353 -0.1793 0.0838 0.0974 0.0953 0.1014 0.0975 0.0994 0.0900 0.1015 0.1325 0.1399 0.1546 0.1383 0.1601 0.1482 0.1459 0.1532 0.1569 0.1544 0.1439
va: 1.2657 1.2365 2.1177 2.0676 2.0767 3.1145 3.7532 3.8335 3.8621 3.9072 3.9109 3.8940 4.1728 4.1828 3.7032 3.8232 4.0875 3.8780 3.9379 3.7834 3.9271 4.0172 3.6911 4.0207 3.9254 3.9263 3.8409 3.8807 1.0468 1.0350 1.0180 0.9994 1.0001 1.0015 1.0051 1.0008 1.0169 1.0293 1.0115 1.0152 0.9893 1.0046 1.0075 1.0001 0.9895 0.9943 1.0102
dispcorr: -0.026914198 hartree
energy: -2050.712365146980
dipole: 11.86944 -12.78145 -0.91201 -10.85009 10.98192 0.13183 -1.58436 0.80062 -0.78374
magnitude: 1.20971 au
magnitude: 3.07483 debye
