program: Gaussian 09
title: 000074389
version: EM64L-G09RevD.01
frameworkgroup: C1[X(C13H9Cl2NO)]
method: RPBEPBE
basis: SDD
operation: Freq
keyword: #p
keyword: freq=noraman
keyword: PBEPBE/SDD
title: #p freq=noraman PBEPBE/SDD
converged: YES YES NO NO
title: Mulliken charges:
elementType: Cl Cl O N C C C C C C C C C C C C C H H H H H H H H H
charge: -0.051126 -0.049231 -0.421611 -0.092310 0.341615 0.340406 -0.012819 -0.368086 -0.332929 -0.371671 -0.370140 -0.212931 -0.221270 -0.207706 -0.214121 -0.115972 -0.112174 0.263061 0.267162 0.267840 0.265857 0.258265 0.258026 0.257285 0.259347 0.375234
chargesum: 0.00000
title: Mulliken charges with hydrogens summed into heavy atoms:
elementType: Cl Cl O N C C C C C C C C C C C C C
charge: -0.051126 -0.049231 -0.046376 -0.092310 0.341615 0.340406 -0.012819 -0.105025 -0.065767 -0.103831 -0.104284 0.045333 0.036756 0.049579 0.045225 -0.115972 -0.112174
polarizability: 2.68109366e+02 3.43188127e+00 1.82751571e+02 -1.49061332e+01 -2.74091784e-01 9.02891890e+01
1716.lowfreq: -6.5450 -0.0011 0.0016 0.0022 3.5493 8.0233 33.9064 41.6732 62.8883
frequency: 33.8789 41.6709 62.8872 68.3023 122.7445 148.2115 186.2003 200.2666 233.3053 266.3805 279.6845 318.3791 341.1867 351.4983 405.6760 413.6106 426.9943 447.4797 470.1597 492.0609 508.3986 586.4026 616.6904 627.0577 650.3943 692.8905 719.7868 731.5723 740.1142 828.5244 831.8749 837.0614 839.7749 878.2469 945.9091 961.4987 965.4795 971.8552 976.4200 1000.2330 1003.2275 1073.3922 1074.6012 1111.8359 1113.3882 1150.7503 1187.9936 1193.3985 1272.8937 1296.2022 1298.3550 1314.6516 1359.5049 1370.0452 1395.3053 1396.8700 1472.9113 1478.5273 1541.7872 1573.7201 1580.8512 1594.6193 1597.9677 3148.2506 3151.5516 3158.9675 3164.8986 3173.8494 3174.2150 3178.9360 3189.3332 3558.2734
redmass: 4.3717 13.8179 7.7327 4.2089 8.2562 8.1005 7.3743 10.2806 10.3077 8.5887 6.7763 5.6338 5.8811 7.8977 2.8972 2.9872 4.5566 1.6716 3.4638 3.2005 3.4929 5.5407 6.4495 7.1765 4.7822 7.1624 4.0574 3.6157 5.5267 1.2655 1.4135 1.3614 1.6593 7.5883 2.5573 1.3349 1.7777 1.5066 1.3592 4.1345 3.9678 2.9254 2.7166 1.3671 1.3816 2.8763 1.1273 1.1307 1.6139 1.2639 1.3538 2.5313 5.5544 5.6785 3.8796 3.1900 2.2978 2.5902 6.1247 7.4367 7.7938 6.0900 6.3178 1.0891 1.0886 1.0885 1.0898 1.0963 1.0963 1.0975 1.0965 1.0674
irintensity: 0.0195 0.0563 0.0376 0.1018 0.0117 0.1168 0.6255 2.3872 0.3466 0.6671 3.0232 1.1525 4.5887 3.9485 0.1136 0.1259 29.2220 112.4671 26.6622 30.7834 15.1753 10.3944 6.6394 1.4281 22.3124 6.9687 1.9142 16.8567 7.0954 10.7726 35.9869 33.0182 74.2395 164.2572 34.0672 0.5309 11.9609 11.4538 1.0442 18.2743 44.3283 35.0254 64.8275 8.0129 2.5468 23.3903 3.7899 1.0995 109.3628 0.7263 4.0740 16.5117 4.7714 3.4845 6.3926 11.5828 38.1246 91.0405 2.5542 2.1179 7.4243 53.5767 19.9936 7.9163 2.6070 1.0100 1.6176 4.5683 3.8722 1.2618 1.3973 74.7663
temp: 298.150 k
press: 1.00000 atm
elementType: 17 17 8 7 6 6 6 6 6 6 6 6 6 6 6 6 6 1 1 1 1 1 1 1 1 1
symmnumber: 1
zpe: 481926.6 jmol-1
zpe.correction: 0.183556 hartree
zpe.thermalcorrener: 0.198493 hartree
zpe.thermalcorrenthalpy: 0.199437 hartree
zpe.thermalcorrgfe: 0.139680 hartree
zpe.sumelectzpe: -1549.646831 hartree
zpe.sumelectthermal: -1549.631895 hartree
zpe.sumelectthermalent: -1549.630951 hartree
zpe.sumelectthermalfe: -1549.690707 hartree
dipole: 0.2212 1.5884 0.0365
dipole: 1.6041
quadrupole: -127.0224 -100.4164 -110.2251
quadrupole: 0.7455 -5.2526 -0.0254
quadrupole: -14.4677 12.1382 2.3295 0.7455 -5.2526 -0.0254
hfenergy: -1549.8303873 hartree
pointgroup: C01 [X(C13H9Cl2N1O1)]
dipole: -0.0784528 0.5960776 0.1919494 debye
dipolederiv: -0.8205397 0.3215982 0.1371502 0.373829 -0.2928289 -0.0565468 0.1589006 -0.0596834 -0.0974685 -0.783169 -0.3478033 -0.0889639 -0.396824 -0.2773856 -0.0806167 -0.1071274 -0.0798496 -0.1268658 -0.7232045 1.0962543 0.3187203 0.4685179 -0.7155332 -0.1371365 0.1299551 -0.0669058 -0.3651996 0.0504069 -0.9547794 -0.2922136 -0.3282923 0.2665497 0.1284914 -0.0620736 0.0070465 -0.1818681 -0.0827662 -0.061316 0.0005903 -0.1442828 -0.0564327 -0.0066464 -0.1371445 0.0759517 0.0005172 -0.1897909 -0.0130708 0.0121205 0.0320259 -0.085747 -0.026291 -0.0208614 -0.0630169 0.0122233 0.9048977 0.0506442 0.0197494 0.0727007 0.1398433 0.0409882 0.0719021 0.0690725 0.0409011 0.0122121 0.0661176 -0.0403439 -0.0692658 0.0315008 -0.005433 -0.0519627 -0.0358245 -0.0994959 0.071421 0.1062681 0.0198664 -0.0178764 -0.0232651 0.1113551 -0.1040963 0.0133864 0.0136825 0.0234474 -0.0680425 -0.038338 0.0879202 0.0541923 -0.0508952 -0.0241898 -0.0052385 -0.1059984 0.0387632 -0.016665 -0.0782185 0.1773513 -0.0104987 0.0506778 0.0315073 0.0897706 0.0018034 -0.3907747 0.0746781 0.0519689 0.031625 0.0129177 -0.0289836 0.0834616 -0.0453629 -0.1151546 -0.243243 -0.1487377 -0.1541882 -0.1711054 -0.1980585 -0.0381741 -0.1647336 -0.0575163 -0.0814917 -0.2224811 0.1934235 -0.0055649 0.2435493 -0.1680164 -0.0566322 0.0027998 -0.0378583 -0.0934778 -0.4137883 -0.1010855 0.0132775 -0.1140866 -0.1161003 0.0635349 0.0543125 0.0729623 -0.0164202 1.0993977 -0.4642552 -0.2317439 -0.5280234 0.3900423 0.0708366 -0.2495836 0.0636712 -0.0132837 1.08089 0.5439741 0.0990364 0.5941891 0.3044341 0.1740568 0.1234161 0.1808468 0.1357382 0.0116328 -0.0622715 0.0575448 -0.103501 0.0467441 0.0172059 0.0753589 0.0140165 0.1072526 0.1073204 -0.036027 -0.0134203 -0.0024399 0.0781613 -0.0888232 -0.0183618 -0.054574 0.0355018 0.1108604 0.0413647 0.0089807 0.0073625 -0.0206235 0.0351037 -0.0087051 0.013764 0.1440985 0.0155763 -0.008055 0.092243 0.0026763 0.0982393 -0.0245792 0.1226728 -0.022562 0.050401 0.087032 0.0207709 0.013532 0.0308209 -0.0383507 0.025855 0.0147304 0.0232597 0.1545506 0.0050692 -0.0192869 0.0810898 -0.0171133 0.1340042 -0.0306146 0.0775695 -0.0310926 0.0591476 -0.0143678 -0.0522161 0.0536451 -0.0481028 0.0661003 0.0283821 0.0525183 0.0326839 0.1429917 0.0924101 -0.0318569 -0.0058753 -0.0435255 0.0861841 -0.0930885 -0.0079736 -0.0869658 0.02704 0.1727881 -0.1296248 -0.0306449 -0.1381291 0.2939271 -0.0220265 -0.0422915 -0.0099816 0.3708748 unknown
polarizability: 266.5574843|2.6551414|172.9113483|-22.1219816|28.4413624|101.6812938 unknown
InChI: InChI=1S/C13H9Cl2NO/c14-11-5-1-9(2-6-11)13(16-17)10-3-7-12(15)8-4-10/h1-8,17H
charge 0 multiplicity 1
26 atoms
Cl 5.386417 -1.701839 -0.721755
Cl -5.234345 -1.862389 -0.53692
O  -1.071268 3.068542 0.999607
N  0.201195 2.387702 0.772955
C  1.340935 0.436182 0.079186
C  -1.246684 0.412833 0.169834
C  0.048531 1.131511 0.365654
C  1.464116 -0.970253 0.24629
C  -2.32459 0.535796 1.088962
C  2.484641 1.175384 -0.333405
C  -1.419115 -0.417515 -0.972452
C  2.691146 -1.625989 0.007868
C  -3.533318 -0.161315 0.885028
C  3.715398 0.533997 -0.57513
C  -2.629473 -1.105676 -1.199585
C  3.800522 -0.862313 -0.401096
C  -3.669652 -0.969375 -0.260482
H  0.603873 -1.559143 0.579667
H  -2.218362 1.17904 1.965087
H  2.396932 2.257617 -0.46434
H  -0.605856 -0.518511 -1.69847
H  2.781703 -2.707244 0.144493
H  -4.356092 -0.071145 1.59986
H  4.589915 1.105489 -0.898942
H  -2.758737 -1.733043 -2.085826
H  -0.771432 3.981454 1.246211
