program: Orca
programVersion: 5.0.2
elementType: Cl Cl O O O N C C C C C C C C C C C C C C C C C C C C C C H H H H H H H H H H H H H H H H H H H
charge: 0
multiplicity: 1
keywords: wb97x-d3
keywords: def2-TZVPP
keywords: def2/J RIJCOSX
keywords: DEFGRID2
keywords: scfconv7
keywords: smallprint printgap noloewdin
keywords: NOSOSCF
formula: C22H19Cl2NO3
InChI: InChI=1/C22H19Cl2NO3/c1-22(2)17(12-19(23)24)20(22)21(26)28-18(13-25)14-7-6-10-16(11-14)27-15-8-4-3-5-9-15/h3-12,17-18,20H,1-2H3
47 atoms
Cl -4.273423 -0.941971 -0.7707
Cl -4.521076 -2.354602 -3.274929
O  1.775081 -2.173933 -0.260823
O  0.340988 -1.544145 1.331132
O  2.369632 3.293704 1.782522
N  5.016569 -1.95979 -0.817048
C  -1.242029 -4.087491 0.395647
C  -1.829938 -2.871752 -0.256256
C  -0.332435 -3.125919 -0.342626
C  -1.246146 -4.147916 1.903218
C  -1.415198 -5.444315 -0.244304
C  -2.618678 -2.949099 -1.490889
C  0.580057 -2.203745 0.353234
C  -3.656913 -2.180504 -1.794593
C  2.74289 -1.283522 0.278151
C  2.436185 0.165233 -0.023134
C  4.007945 -1.674129 -0.348471
C  2.496274 1.094053 1.002947
C  2.098067 0.558665 -1.312781
C  2.237163 2.432288 0.736239
C  1.832235 1.895572 -1.561648
C  1.904682 2.841566 -0.548694
C  1.617112 4.438746 1.833064
C  0.236253 4.40723 1.68299
C  2.276483 5.627434 2.104662
C  -0.483316 5.586825 1.803545
C  1.542334 6.798467 2.234336
C  0.163501 6.784513 2.079501
H  -2.109803 -2.0842 0.434047
H  0.036932 -3.487096 -1.295539
H  -2.133701 -4.686712 2.239385
H  -1.26263 -3.169571 2.377215
H  -0.374108 -4.690027 2.273368
H  -1.298439 -5.429164 -1.327097
H  -2.403078 -5.84978 -0.018213
H  -0.673473 -6.140761 0.150334
H  -2.332365 -3.688393 -2.229173
H  2.855041 -1.429568 1.357661
H  2.746296 0.78577 2.011166
H  2.046068 -0.162186 -2.119112
H  1.573741 2.214425 -2.562769
H  1.708504 3.882826 -0.770222
H  -0.276528 3.474644 1.481703
H  3.353079 5.633963 2.220578
H  -1.559349 5.565075 1.688693
H  2.05601 7.726183 2.451094
H  -0.405163 7.699965 2.176254
elementType: Cl O N C H
totalener: -2050.68665198 hartree
nucrepener: 2694.50972716 hartree
electener: -4745.19637913 hartree
oneelecener: -8164.54949278 hartree
twoeener: 3419.35311365 hartree
cpcmener: -0.03159116 hartree
kineticenergy: 2044.47426084 hartree
xcener: -151.863620358538 hartree
chargesum: -0.0000000
charge: -0.054535 -0.059701 -0.282080 -0.440663 -0.325493 -0.087562 0.088467 0.026777 -0.067366 -0.267160 -0.268416 -0.198857 0.382893 0.041452 0.406841 0.018178 -0.224719 -0.218587 -0.220526 0.255851 -0.146396 -0.168602 0.255920 -0.178016 -0.229555 -0.147082 -0.130759 -0.173406 0.082228 0.095724 0.097496 0.095462 0.100814 0.091915 0.102722 0.098799 0.127589 0.140003 0.132941 0.148856 0.159752 0.157479 0.159231 0.146592 0.159214 0.158036 0.158247
qa: -0.0545 -0.0597 -0.2821 -0.4407 -0.3255 -0.0876 0.0885 0.0268 -0.0674 -0.2672 -0.2684 -0.1989 0.3829 0.0415 0.4068 0.0182 -0.2247 -0.2186 -0.2205 0.2559 -0.1464 -0.1686 0.2559 -0.1780 -0.2296 -0.1471 -0.1308 -0.1734 0.0822 0.0957 0.0975 0.0955 0.1008 0.0919 0.1027 0.0988 0.1276 0.1400 0.1329 0.1489 0.1598 0.1575 0.1592 0.1466 0.1592 0.1580 0.1582
va: 1.2711 1.2451 2.1299 2.0744 2.0762 3.1122 3.7384 3.8732 3.8386 3.9044 3.9111 3.9020 4.1878 4.2154 3.7225 3.6231 4.0753 4.0674 3.9751 3.7834 3.9284 3.9003 3.7079 3.9186 4.0047 3.8903 3.8887 3.8968 1.0467 1.0333 1.0000 1.0188 0.9993 1.0058 1.0003 1.0012 1.0201 1.0173 1.0194 1.0105 0.9909 0.9959 0.9955 1.0070 0.9903 0.9893 0.9902
dispcorr: -0.022798320 hartree
energy: -2050.709450294515
dipole: 13.63741 -14.83131 -1.19390 0.91566 -1.12111 -0.20545 15.23532 -15.13880 0.09652
magnitude: 1.21529 au
magnitude: 3.08902 debye
