program: Gaussian 09
title: 000074381
version: EM64L-G09RevD.01
frameworkgroup: C1[X(C9H9Cl)]
method: RPBEPBE
basis: SDD
operation: Freq
keyword: #pfreq=noraman
keyword: PBEPBE/SDD
title: #p freq=noraman PBEPBE/SDD
converged: YES YES NO NO
title: Mulliken charges:
elementType: Cl C C C C C C C C C H H H H H H H H H
charge: -0.060445 0.357514 0.388356 -0.358465 -0.366560 -0.225639 -0.230486 -0.813491 -0.103023 -0.693484 0.230447 0.242295 0.254045 0.253128 0.233800 0.226139 0.230458 0.219051 0.216360
chargesum: 0.00000
title: Mulliken charges with hydrogens summed into heavy atoms:
elementType: Cl C C C C C C C C C
charge: -0.060445 0.357514 0.388356 -0.128018 -0.124265 0.028406 0.022642 -0.123095 -0.103023 -0.258073
polarizability: 1.71654356e+02 -1.12611579e+01 1.05832398e+02 2.19933609e+00 5.46160274e-01 4.74119131e+01
1716.lowfreq: -5.9433 0.0005 0.0012 0.0019 2.8811 10.3886 34.7940 83.9203 176.2903
frequency: 34.7863 83.9152 176.2872 223.4503 248.1333 294.5966 309.1403 405.8600 425.9185 446.0566 472.5036 543.7714 581.8052 626.6235 668.2842 738.8473 745.6275 824.2779 839.6706 927.8782 933.6806 952.3978 964.7365 996.2303 1003.0999 1048.9667 1076.3056 1113.4994 1121.2344 1196.2620 1299.3443 1307.5701 1359.6160 1391.0883 1401.3898 1430.6626 1469.4160 1479.8092 1486.6027 1574.6082 1597.7440 1644.1244 2973.4643 3050.2363 3095.2783 3105.6577 3148.4616 3152.0716 3171.0120 3175.3025 3204.3974
redmass: 3.0349 5.8342 4.6908 1.0970 4.4964 4.8285 5.2503 2.9008 3.5344 3.1815 3.1571 2.1029 4.1587 7.0274 1.5147 1.8857 5.2987 1.2599 1.6419 1.9693 1.4151 1.3503 1.3719 4.1308 1.3696 1.5190 3.1591 1.9810 1.4532 1.1274 1.4704 2.4278 5.1150 1.5975 2.1759 1.2614 1.0614 1.5215 1.4132 6.6116 6.0915 4.5190 1.0381 1.0968 1.0981 1.0623 1.0878 1.0877 1.0961 1.0971 1.1135
irintensity: 0.1267 0.0093 0.1909 0.6950 1.5300 2.2444 0.9284 0.7721 6.8098 13.4265 12.7823 3.6340 9.7179 0.4124 2.2917 6.9193 16.5584 1.1535 68.6261 9.5435 61.7988 1.6330 1.7087 34.0484 2.4649 3.8200 30.7483 11.7419 9.8739 0.1009 5.7507 15.4286 5.0390 8.2455 25.3625 0.8531 16.2692 89.2923 6.6197 2.0047 13.7135 18.2974 21.5357 22.3457 28.1533 4.7794 5.7328 6.2578 11.5507 0.7123 21.2598
temp: 298.150 k
press: 1.00000 atm
elementType: 17 6 6 6 6 6 6 6 6 6 1 1 1 1 1 1 1 1 1
symmnumber: 1
zpe: 392026.4 jmol-1
zpe.correction: 0.149315 hartree
zpe.thermalcorrener: 0.158755 hartree
zpe.thermalcorrenthalpy: 0.159699 hartree
zpe.thermalcorrgfe: 0.113793 hartree
zpe.sumelectzpe: -807.681579 hartree
zpe.sumelectthermal: -807.672139 hartree
zpe.sumelectthermalent: -807.671194 hartree
zpe.sumelectthermalfe: -807.717101 hartree
dipole: -2.2680 -0.3074 0.0768
dipole: 2.2900
quadrupole: -67.6025 -58.2056 -70.7783
quadrupole: 1.3979 -0.0851 0.5147
quadrupole: -2.0737 7.3232 -5.2495 1.3979 -0.0851 0.5147
hfenergy: -807.8308938 hartree
pointgroup: C01 [X(C9H9Cl1)]
dipole: -0.8913998 0.123467 -0.043521 debye
dipolederiv: -0.9584471 -0.0341627 -0.0045896 -0.0166396 -0.1306875 -0.0045601 -0.0039008 -0.0039936 -0.0734387 0.1655178 0.1008003 -0.026864 0.1328339 -0.1138629 0.0211151 -0.0854634 -0.0053357 0.011907 0.4029788 -0.0569024 0.0114885 -0.1381715 0.2701759 -0.0819558 0.0839879 -0.0340737 -0.0274958 -0.0559796 0.0332261 0.0170056 0.0074771 0.0651108 0.0311577 0.0323443 0.0211634 -0.1365095 -0.0106122 -0.0478433 0.004696 -0.0489572 0.0451278 0.0087602 -0.0079867 0.0213112 -0.1587926 -0.3146957 -0.0763279 -0.0107481 -0.1081665 0.0057119 0.0140513 -0.011679 0.0086284 -0.1021169 -0.3333568 0.0537754 0.0042881 0.1359258 0.0218585 0.0069716 0.0150499 0.0125988 -0.108345 -0.0743474 0.0627071 -0.0077282 0.0844141 -0.1025535 0.0351868 -0.0271335 0.012322 0.0847662 1.2891491 0.036023 0.0113691 0.0147039 0.1103914 0.0139424 0.0075572 0.0140372 -0.07313 -0.2149336 -0.1115614 0.039279 -0.1110003 -0.1735507 -0.069689 0.0408279 -0.0637455 -0.3937206 0.0344802 -0.0973365 -0.0142124 -0.0605425 -0.0329755 -0.0222802 -0.0160398 -0.0134255 0.1404124 0.0464279 0.0904304 0.0085248 0.0911881 -0.036412 -0.0097557 0.0137353 -0.0133984 0.1432797 0.0398979 0.0707488 0.0045725 0.0707886 -0.0038859 -0.0142943 0.0027911 -0.0171771 0.1635825 0.0484156 -0.0692741 -0.0052646 -0.0694854 -0.0125103 -0.012485 -0.0061019 -0.0123495 0.1646893 0.0808533 -0.0309456 0.0925771 -0.0117406 0.0197039 0.0796674 0.0569382 0.0975115 -0.0645282 0.1081538 -0.0369999 -0.0636377 -0.010189 -0.0528188 -0.0863762 -0.0334255 -0.1111683 -0.0226631 -0.1697676 0.017709 -0.0269311 -0.0839351 0.0843099 -0.0000855 -0.0040358 0.0104997 0.1067574 -0.1350348 -0.0079569 -0.0060446 0.0264368 0.0900711 0.024333 -0.035479 0.015461 0.1746691 0.0513003 0.1038907 -0.0277805 0.0950594 -0.0532042 0.0662966 -0.0219867 0.0611342 0.1706768 unknown
polarizability: 171.7835568|10.9314838|105.7166941|-1.2679049|-1.2394709|47.3984166 unknown
InChI: InChI=1S/C9H9Cl/c1-7(2)8-3-5-9(10)6-4-8/h3-6H,1H2,2H3
charge 0 multiplicity 1
19 atoms
Cl 3.936248 0.056213 0.032622
C  -0.726515 -0.046741 -0.009095
C  -2.221816 -0.066282 -0.015889
C  0.042674 -1.243934 -0.095775
C  -0.015043 1.183784 0.070179
C  1.450994 -1.222465 -0.079955
C  1.396387 1.226945 0.087824
C  -2.945122 1.244065 -0.293875
C  2.111902 0.018777 0.016516
C  -2.94135 -1.200084 0.230576
H  -0.461181 -2.209998 -0.199998
H  -0.561804 2.129667 0.129151
H  2.025049 -2.150724 -0.152592
H  1.925491 2.181804 0.156232
H  -2.596465 1.707809 -1.23577
H  -2.776559 1.979967 0.516268
H  -4.032566 1.080759 -0.371053
H  -4.03611 -1.189609 0.20707
H  -2.474014 -2.158254 0.481464
